program: Gaussian 09
title: 000041824
version: EM64L-G09RevD.01
frameworkgroup: C1[X(C18H21ClO)]
method: RPBEPBE
basis: SDD
operation: Freq
keyword: #p
keyword: freq=noraman
keyword: PBEPBE/SDD
title: #p freq=noraman PBEPBE/SDD
converged: YES YES NO NO
title: Mulliken charges:
elementType: Cl O C C C C C C C C C C C C C C C C C C H H H H H H H H H H H H H H H H H H H H H
charge: -0.075534 -0.264665 -0.354466 -0.394308 0.522109 0.508303 -0.662135 -0.415456 -0.386376 -0.433509 -0.382580 -0.391352 -0.417237 0.435282 -0.375395 -0.363604 0.331366 -0.809773 -0.243600 -0.685004 0.238646 0.261219 0.223811 0.236696 0.240009 0.227342 0.230578 0.235847 0.247565 0.226214 0.226062 0.249759 0.243944 0.224860 0.224484 0.233059 0.207123 0.208702 0.207389 0.232609 0.232014
chargesum: 0.00000
title: Mulliken charges with hydrogens summed into heavy atoms:
elementType: Cl O C C C C C C C C C C C C C C C C C C
charge: -0.075534 -0.264665 -0.115819 -0.133090 0.522109 0.508303 0.038382 -0.188115 -0.155797 -0.197662 -0.135014 -0.165137 -0.191175 0.435282 -0.125636 -0.119659 0.331366 -0.127370 0.172225 -0.012993
polarizability: 2.71899071e+02 -8.28788613e+00 1.93773207e+02 -7.61387054e+00 1.09538835e+01 1.70230192e+02
1716.lowfreq: -36.5853 -11.9560 -2.8795 -0.0020 0.0010 0.0018 6.2694 22.8418 31.2871
frequency: -36.5480 22.5837 31.2416 33.9662 49.9701 53.6509 79.8256 104.6891 112.5725 131.7596 160.3969 172.1876 196.5499 243.3222 245.4163 247.7116 295.6413 299.2663 336.0964 353.7612 356.9774 374.7876 402.9644 413.4477 425.4176 439.9192 501.8448 525.4252 552.9055 578.4556 624.7753 630.1441 638.7501 718.0217 736.5342 759.0205 765.4882 801.8838 810.2998 832.1770 833.3933 843.0859 846.9442 854.2616 904.2343 920.4171 945.8487 952.6112 964.2521 971.0788 985.3500 1003.4717 1010.5667 1016.1826 1037.8720 1047.1131 1080.7834 1111.2031 1116.8666 1119.8542 1135.2961 1141.2885 1179.5573 1184.9596 1189.0587 1196.9457 1205.4835 1224.8884 1226.8627 1245.8660 1262.1849 1280.6528 1309.7309 1314.7893 1348.5535 1364.4376 1375.2316 1383.4537 1394.1518 1396.7895 1400.4955 1409.2800 1418.6608 1461.3318 1464.0497 1471.6894 1472.4809 1473.2443 1476.8829 1486.1801 1500.1689 1509.7775 1580.7319 1584.9389 1619.1131 1626.2245 2952.9218 2973.4928 2993.0356 2994.6747 2997.1695 3010.3928 3054.3964 3058.3246 3083.1619 3091.1557 3094.5997 3104.4204 3105.7734 3109.1456 3115.0833 3122.3141 3130.9271 3133.2926 3144.3888 3160.2238 3164.6606
redmass: 1.0154 3.8136 4.0843 3.5357 4.3881 4.7279 5.0630 3.5343 1.8559 4.1466 3.9239 5.6672 6.8502 1.6276 1.3359 1.8245 3.1473 3.7307 2.8201 3.6250 3.9157 4.0008 2.8331 2.9584 3.8212 3.6786 3.0350 3.0420 4.6381 3.7127 4.5005 6.2509 6.6782 3.4049 3.7175 2.7601 3.6009 2.6167 1.3465 1.3460 1.4526 1.9831 1.2841 3.0721 3.2867 1.9480 1.3858 1.4066 1.3568 1.3873 1.4076 2.7851 2.0368 1.9959 2.8517 1.5568 2.1858 1.7165 1.9276 1.5956 1.4439 1.6386 1.4618 1.2765 2.0226 1.1712 1.9526 2.7837 3.0947 1.7018 1.1394 1.3757 1.3303 1.3136 1.5594 1.5728 3.2228 3.0231 1.2203 1.2254 1.3014 2.6667 3.3352 1.0399 1.0462 1.0740 1.0528 1.0675 1.1063 1.2057 1.8599 2.6433 6.9820 5.9684 6.3403 6.4075 1.0554 1.0386 1.0404 1.0779 1.0362 1.1074 1.0950 1.0876 1.0997 1.0986 1.0989 1.1001 1.1013 1.0869 1.0876 1.0894 1.0882 1.0961 1.0956 1.0944 1.0952
irintensity: 0.4843 0.1916 0.0620 0.7173 0.2302 1.0012 1.7637 1.6792 2.3468 0.9567 0.2941 0.3178 2.3583 0.4241 0.5614 0.2805 1.3961 3.1923 0.3324 0.7429 0.8988 6.2280 0.5022 0.1962 1.8849 1.1159 2.9239 22.9724 20.1003 72.4548 11.5811 1.3263 0.9607 3.4376 3.7239 3.6031 7.4988 24.8188 21.6708 21.2708 13.5785 19.0707 3.3257 5.1113 34.4276 11.5125 0.8335 1.9767 0.8216 0.4620 0.6937 8.7159 7.9812 16.5427 63.4158 15.9292 13.5280 4.3663 9.7535 4.6335 4.1184 37.7330 69.1995 60.4908 4.6404 3.6321 7.8363 2.9314 246.5903 4.4009 0.0217 1.9688 1.5258 0.3400 3.4859 5.0188 4.9623 11.3061 19.1660 9.6247 40.0976 1.3152 0.2196 11.7562 10.1821 18.3963 6.3203 11.6967 45.0038 58.8018 76.7071 31.3514 11.9893 2.2925 64.0837 2.4069 36.6833 42.9435 11.8611 12.5710 27.8692 35.7560 24.4871 6.2809 18.1139 25.3235 27.9635 22.0931 34.4142 12.1592 23.7634 13.1426 9.7584 35.4552 9.1737 15.3936 6.4776
temp: 298.150 k
press: 1.00000 atm
elementType: 17 8 6 6 6 6 6 6 6 6 6 6 6 6 6 6 6 6 6 6 1 1 1 1 1 1 1 1 1 1 1 1 1 1 1 1 1 1 1 1 1
symmnumber: 1
zpe: 888432.0 jmol-1
zpe.correction: 0.338386 hartree
zpe.thermalcorrener: 0.358136 hartree
zpe.thermalcorrenthalpy: 0.359080 hartree
zpe.thermalcorrgfe: 0.287820 hartree
zpe.sumelectzpe: -1232.330593 hartree
zpe.sumelectthermal: -1232.310843 hartree
zpe.sumelectthermalent: -1232.309899 hartree
zpe.sumelectthermalfe: -1232.381159 hartree
dipole: -2.9849 -2.1684 -1.3252
dipole: 3.9202
quadrupole: -124.9866 -123.7788 -117.7138
quadrupole: -6.0552 5.9224 3.9305
quadrupole: -2.8269 -1.6191 4.4459 -6.0552 5.9224 3.9305
hfenergy: -1232.6689791 hartree
pointgroup: C01 [X(C18H21Cl1O1)]
dipole: 1.094742 0.9252707 -0.5693716 debye
polarizability: 272.5930035|-0.2392639|191.5768721|9.5629495|-11.5115622|171.7325941 unknown
InChI: InChI=1S/C18H21ClO/c1-4-20-17-11-9-16(10-12-17)18(14(3)19)15-7-5-13(2)6-8-15/h5-12,14,18H,4H2,1-3H3
charge 0 multiplicity 1
41 atoms
Cl -2.811581 -3.381413 -0.254524
O  4.513057 0.568938 0.254844
C  -0.934803 -1.386898 0.470028
C  -1.047732 -2.633733 -0.444105
C  -1.967315 -0.284728 0.196084
C  0.501734 -0.831569 0.387668
C  -0.056998 -3.75641 -0.131196
C  -2.306575 0.602234 1.24843
C  -2.565545 -0.068165 -1.069069
C  1.434014 -1.084051 1.428609
C  0.938589 -0.078097 -0.728048
C  -3.207034 1.668491 1.045713
C  -3.467448 0.999805 -1.272333
C  -3.801634 1.89192 -0.222926
C  2.755308 -0.605778 1.359393
C  2.263024 0.404598 -0.820549
C  3.177941 0.139185 0.230021
C  -4.751537 3.055611 -0.451703
C  5.005132 1.356989 -0.89234
C  6.465597 1.693054 -0.603302
H  -1.091742 -1.748455 1.505855
H  -1.008931 -2.359266 -1.51146
H  -0.14192 -4.074206 0.92298
H  0.977269 -3.410958 -0.308445
H  -0.250221 -4.631395 -0.773585
H  -1.859623 0.453883 2.23974
H  -2.361756 -0.749135 -1.902781
H  1.120642 -1.662132 2.306575
H  0.230889 0.160228 -1.53041
H  -3.455871 2.333632 1.882032
H  -3.926882 1.135994 -2.259357
H  3.474222 -0.793586 2.162796
H  2.562001 0.986636 -1.6973
H  -5.483431 2.829998 -1.247336
H  -5.311863 3.307006 0.46628
H  -4.20096 3.966115 -0.759694
H  4.905574 0.757949 -1.821264
H  4.393221 2.276654 -0.99816
H  6.890778 2.285714 -1.433629
H  6.552823 2.279957 0.326843
H  7.061886 0.771784 -0.489074
