program: Gaussian 09
title: 000005472
version: EM64L-G09RevD.01
frameworkgroup: C1[X(C14H14ClNS)]
method: RPBEPBE
basis: SDD
operation: Freq
keyword: #p
keyword: freq=noraman
keyword: PBEPBE/SDD
title: #p freq=noraman PBEPBE/SDD
converged: YES YES NO NO
title: Mulliken charges:
elementType: Cl S N C C C C C C C C C C C C C C H H H H H H H H H H H H H H
charge: -0.063689 0.242868 -0.091352 -0.374220 -0.428738 -0.442592 0.497463 -0.417566 -0.510513 0.597662 -0.265173 -0.534785 -0.301674 -0.401326 -0.230336 -0.242542 -0.227157 0.194592 0.218623 0.247150 0.188919 0.211762 0.242558 0.226009 0.197043 0.245890 0.262179 0.238944 0.254156 0.231188 0.234658
chargesum: 0.00000
title: Mulliken charges with hydrogens summed into heavy atoms:
elementType: Cl S N C C C C C C C C C C C C C C
charge: -0.063689 0.242868 -0.091352 0.038995 0.007330 0.011729 0.497463 -0.417566 -0.087461 0.597662 -0.019282 -0.272606 -0.301674 -0.162382 0.023820 -0.011355 0.007501
polarizability: 2.01515468e+02 2.05742028e+01 1.88666135e+02 5.67684254e-01 -4.64708625e+00 1.27839010e+02
1716.lowfreq: -14.5733 -7.3482 0.0007 0.0011 0.0014 2.1009 20.0178 27.4025 40.8613
frequency: 19.8947 27.1286 40.8193 87.4725 139.1118 140.4430 181.8147 218.6685 243.7306 257.1394 275.8891 319.0735 334.3017 378.0840 405.2615 424.1098 439.0198 459.4719 479.1372 527.3009 580.5653 588.5132 603.1397 635.1964 662.3547 697.0284 706.5424 724.3765 757.3742 778.9997 801.0135 822.1696 872.5036 875.4611 896.5899 938.8712 950.3446 975.4425 985.1923 994.8871 1006.4279 1020.8627 1038.7765 1047.6214 1077.0782 1111.2894 1126.2046 1147.2607 1171.7223 1182.9189 1188.0384 1209.2816 1212.2259 1215.8833 1247.1761 1273.6662 1292.1653 1321.0032 1323.1305 1352.0171 1377.7499 1379.1915 1401.0916 1425.3904 1446.5891 1453.5696 1464.0326 1469.0502 1478.6123 1488.3006 1577.2350 1595.5299 1604.1299 2796.8992 2847.4535 2862.6346 2983.6656 3001.0946 3034.1769 3036.7871 3044.3824 3119.7085 3139.9401 3157.8275 3161.6209 3173.5559 3238.5155
redmass: 5.3180 6.9728 5.8841 4.9846 4.1082 3.8908 4.2186 4.7730 5.8552 2.5024 3.1054 2.6533 5.5740 3.4411 4.0449 3.9112 3.4093 4.0636 4.0867 4.8872 4.2520 3.4529 4.4987 4.4158 6.4180 4.5572 1.3518 3.8361 1.2748 2.8877 3.7041 3.7633 1.4483 1.3027 2.4759 1.7990 1.5245 2.2365 1.3340 2.2443 2.3617 6.6219 2.1434 2.1075 1.3079 1.9305 1.9584 2.1667 1.0773 1.8034 1.1580 1.7415 1.9487 1.2815 1.5402 1.4312 1.5481 1.2902 1.6384 1.6649 2.0038 3.4774 2.4894 2.1217 1.1143 1.3549 1.5284 1.1812 1.1348 5.6185 6.1099 6.5325 7.1840 1.0717 1.0708 1.0711 1.0595 1.0842 1.0885 1.0981 1.0911 1.0882 1.0886 1.0946 1.0924 1.0995 1.0992
irintensity: 0.0773 0.2028 0.2083 0.6290 0.6639 0.0772 0.3601 2.6958 0.4687 7.9972 5.3283 2.9671 2.9051 0.9959 1.4423 4.6707 4.3219 7.9959 0.7829 1.2906 4.7638 3.5262 8.2736 4.4260 15.9951 9.5451 62.8542 1.3821 92.3531 2.4580 17.5857 5.5567 2.8774 3.6134 8.6610 2.4988 3.8887 22.1316 0.0372 3.9247 23.7787 54.3882 8.6308 11.9109 8.0903 46.2828 9.4107 5.0413 0.7759 14.4705 3.3305 2.2856 5.3691 4.3552 20.6165 3.6781 21.9246 17.8168 16.9261 13.9729 3.4928 1.2217 5.8933 19.2356 9.5581 13.2695 16.0486 3.0503 16.2882 8.2747 8.8689 0.8087 3.2654 73.6357 57.2419 189.0784 27.9867 19.7311 1.3416 32.0272 42.4078 7.5821 8.2515 17.0879 5.9348 14.5631 0.7543
temp: 298.150 k
press: 1.00000 atm
elementType: 17 16 7 6 6 6 6 6 6 6 6 6 6 6 6 6 6 1 1 1 1 1 1 1 1 1 1 1 1 1 1
symmnumber: 1
zpe: 637417.7 jmol-1
zpe.correction: 0.242780 hartree
zpe.thermalcorrener: 0.257820 hartree
zpe.thermalcorrenthalpy: 0.258764 hartree
zpe.thermalcorrgfe: 0.198309 hartree
zpe.sumelectzpe: -1453.509119 hartree
zpe.sumelectthermal: -1453.494078 hartree
zpe.sumelectthermalent: -1453.493134 hartree
zpe.sumelectthermalfe: -1453.553589 hartree
dipole: -1.4066 -1.7607 1.5441
dipole: 2.7318
quadrupole: -113.2257 -105.4675 -112.1500
quadrupole: 5.2035 2.6644 1.8391
quadrupole: -2.9447 4.8136 -1.8689 5.2035 2.6644 1.8391
hfenergy: -1453.7518983 hartree
pointgroup: C01 [X(C14H14Cl1N1S1)]
dipole: 0.5447091 -0.5128515 -0.771623 debye
polarizability: 202.4108572|-18.8742377|181.9176893|-7.1994364|18.476078|133.6920667 unknown
InChI: InChI=1S/C14H14ClNS/c15-13-4-2-1-3-11(13)9-16-7-5-14-12(10-16)6-8-17-14/h1-4,6,8H,5,7,9-10H2
charge 0 multiplicity 1
31 atoms
Cl 2.084265 2.184176 1.33281
S  -4.540787 0.036307 1.097966
N  -0.355619 0.793695 -0.627058
C  -1.305882 1.914623 -0.798213
C  -0.955887 -0.543211 -0.821191
C  -2.394121 1.867559 0.303588
C  -2.308824 -0.649094 -0.14791
C  -2.949157 0.469924 0.357952
C  0.931741 0.95499 -1.335232
C  2.054897 0.186177 -0.651842
C  -3.060488 -1.872233 0.027487
C  -4.270909 -1.691383 0.672635
C  2.640664 0.620441 0.561429
C  2.559411 -1.015635 -1.212091
C  3.666361 -0.092388 1.210329
C  3.587355 -1.754249 -0.58428
C  4.139983 -1.292592 0.631356
H  -1.802899 1.901761 -1.801423
H  -0.740419 2.859722 -0.713189
H  -0.265794 -1.301281 -0.402895
H  -1.069227 -0.78457 -1.913652
H  -3.182877 2.611785 0.080765
H  -1.93801 2.142059 1.274456
H  1.178618 2.032271 -1.337243
H  0.869669 0.625005 -2.403485
H  -2.709265 -2.851657 -0.309814
H  -5.027511 -2.427038 0.938098
H  2.131494 -1.367452 -2.159217
H  4.090167 0.284876 2.145627
H  3.954107 -2.680108 -1.039839
H  4.937241 -1.854378 1.129576
