program: Gaussian 09
title: 000041823
version: EM64L-G09RevD.01
frameworkgroup: C1[X(C19H24O)]
method: RPBEPBE
basis: SDD
operation: Freq
keyword: #pfreq=noraman
keyword: PBEPBE/SDD
title: #p freq=noraman PBEPBE/SDD
converged: YES YES NO NO
title: Mulliken charges:
elementType: O C C C C C C C C C C C C C C C C C C C H H H H H H H H H H H H H H H H H H H H H H H H
charge: -0.267683 -0.392701 -0.059676 0.513528 0.529400 -0.720570 -0.720910 -0.432423 -0.405076 -0.445592 -0.382434 -0.387399 -0.423123 0.431919 -0.377388 -0.372768 0.329003 -0.809930 -0.241312 -0.686530 0.195866 0.196666 0.209868 0.204316 0.244259 0.241721 0.198583 0.209600 0.227592 0.228363 0.230394 0.235856 0.225292 0.225956 0.245890 0.240153 0.233615 0.223225 0.223862 0.206653 0.205251 0.205573 0.231338 0.231775
chargesum: 0.00000
title: Mulliken charges with hydrogens summed into heavy atoms:
elementType: O C C C C C C C C C C C C C C C C C C C
charge: -0.267683 -0.196835 0.136990 0.513528 0.529400 -0.062128 -0.071006 -0.204831 -0.176713 -0.215198 -0.146578 -0.162107 -0.197168 0.431919 -0.131498 -0.132615 0.329003 -0.129227 0.170591 -0.017845
polarizability: 2.64090049e+02 9.88504963e+00 1.93031858e+02 5.14677773e+00 1.07117745e+01 1.78723408e+02
1716.lowfreq: -38.4788 -12.0177 -9.3833 -4.4063 -0.0007 -0.0004 -0.0002 23.9331 31.1894
frequency: -38.4408 23.8131 31.0708 41.8868 54.2966 70.8407 83.8879 101.7667 117.8035 141.5709 160.0911 175.3914 190.1937 222.7523 245.3341 246.5079 248.6350 303.1798 318.9145 344.8791 359.3898 363.7376 405.0446 409.3744 411.7763 423.0829 449.2249 506.9662 534.4978 556.9667 595.9211 629.5278 638.2298 717.6767 731.2124 757.8723 768.6691 798.2497 806.5828 826.6646 830.1119 832.5016 850.1020 855.0107 867.6846 904.1852 917.9668 933.0716 943.2082 956.2309 957.9933 961.6021 972.7139 984.8948 1003.1501 1013.0314 1038.5298 1046.8717 1095.6339 1111.6666 1118.0627 1125.5477 1134.0477 1136.1299 1169.6817 1178.7319 1187.6972 1194.6380 1202.1273 1222.8738 1223.6331 1249.9891 1261.1910 1267.4551 1303.8985 1307.0477 1315.9610 1335.7924 1362.7993 1371.6306 1377.8607 1384.0425 1394.8783 1396.7120 1399.4548 1407.7520 1416.9375 1461.2378 1465.5139 1468.7447 1471.3005 1473.0388 1476.7792 1478.0881 1487.2559 1488.0046 1499.7041 1506.3333 1580.9583 1581.6180 1619.8723 1624.4962 2949.9835 2953.8867 2969.4285 2970.8993 2972.5672 2975.2079 2996.1071 3007.2093 3053.3794 3056.7529 3065.0962 3081.8746 3082.7469 3086.9090 3093.3572 3104.9300 3107.6716 3109.0398 3118.5176 3129.3449 3130.5025 3136.8146 3158.8361 3162.9598
redmass: 1.0117 4.0055 3.3559 3.6064 3.6503 2.4573 4.0964 3.4470 1.7615 3.4394 3.7329 3.9325 1.1524 1.2604 2.6500 1.7203 1.9480 3.7130 3.3463 2.6719 3.3853 3.9394 2.8521 2.4106 2.9249 3.4126 3.4004 2.8037 3.1126 3.4124 4.6617 6.8221 6.8045 3.4752 3.7251 3.2044 3.2326 2.4079 1.5078 1.6295 1.9520 1.1728 1.2551 3.0021 2.3703 3.2409 1.1819 1.6422 1.5173 1.4686 1.4083 1.4304 1.3800 1.4057 2.7255 2.9201 2.8679 1.5547 1.6933 1.5991 1.9072 2.1320 1.4290 1.4347 1.8168 1.3366 2.2997 1.2591 2.0439 3.1766 2.7319 1.6214 1.1442 1.6080 1.3691 1.3502 1.3963 1.3632 1.5736 3.4475 1.2157 2.8921 1.2296 1.2256 1.3079 2.7312 3.2199 1.0401 1.0492 1.0484 1.0821 1.0639 1.1036 1.0492 1.2064 1.0637 1.8441 2.6434 6.1552 6.6493 6.4045 6.4505 1.0553 1.0808 1.0376 1.0642 1.0387 1.0559 1.0362 1.1074 1.0950 1.0987 1.0980 1.0996 1.0989 1.0985 1.0989 1.1013 1.0867 1.0868 1.0892 1.0901 1.0935 1.0967 1.0942 1.0951
irintensity: 0.5131 0.2876 0.6632 0.5429 0.1318 0.0496 0.4319 1.2753 2.4348 0.8735 0.6013 0.5235 0.0964 0.0207 0.7076 0.1156 0.2438 0.1077 0.9130 0.3550 1.2184 1.2915 0.0743 0.5227 0.3564 1.4560 0.2886 7.9318 18.4137 18.7179 27.1988 1.6229 0.2070 2.3796 0.8354 1.8840 8.5665 21.9531 26.3042 32.1921 18.2734 1.9570 0.3217 1.8827 16.8336 36.3820 6.3055 2.7302 2.4336 1.0342 0.1532 2.2122 0.1453 0.6724 7.3103 4.4451 64.2628 19.2568 6.2980 1.2808 5.7954 1.2005 23.2942 3.9714 31.1415 93.7922 5.4966 4.1312 8.6974 139.3588 91.1770 2.8358 0.0473 1.7438 2.7277 0.3358 0.1615 3.7201 5.8102 4.2033 12.4235 10.7204 21.5972 9.7732 36.4368 1.2073 0.1309 11.5023 4.9528 1.5834 14.7359 10.8599 44.1530 10.7349 52.9596 25.1068 83.3399 31.1088 1.3455 11.8264 42.9556 4.9596 38.4662 0.6583 24.5734 11.1279 48.4133 74.8098 29.1820 37.5801 23.3413 1.0711 77.0693 18.8325 32.9210 43.3206 29.3240 34.7734 3.7127 32.0466 15.0858 19.6783 41.8433 1.2212 17.8796 6.4570
temp: 298.150 k
press: 1.00000 atm
elementType: 8 6 6 6 6 6 6 6 6 6 6 6 6 6 6 6 6 6 6 6 1 1 1 1 1 1 1 1 1 1 1 1 1 1 1 1 1 1 1 1 1 1 1 1
symmnumber: 1
zpe: 983887.7 jmol-1
zpe.correction: 0.374743 hartree
zpe.thermalcorrener: 0.394816 hartree
zpe.thermalcorrenthalpy: 0.395760 hartree
zpe.thermalcorrgfe: 0.324763 hartree
zpe.sumelectzpe: -812.158943 hartree
zpe.sumelectthermal: -812.138870 hartree
zpe.sumelectthermalent: -812.137926 hartree
zpe.sumelectthermalfe: -812.208922 hartree
dipole: 0.0724 -0.9938 -1.3761
dipole: 1.6990
quadrupole: -113.5297 -117.4958 -113.1307
quadrupole: -1.5914 -5.5910 4.0174
quadrupole: 1.1891 -2.7771 1.5880 -1.5914 -5.5910 4.0174
hfenergy: -812.5336858 hartree
pointgroup: C01 [X(C19H24O1)]
dipole: -0.0219498 -0.3760596 0.5522014 debye
polarizability: 264.3933023|-8.6010551|192.1272011|5.5124725|-11.0000272|179.3248114 unknown
InChI: InChI=1S/C19H24O/c1-5-20-18-12-10-17(11-13-18)19(14(2)3)16-8-6-15(4)7-9-16/h6-14,19H,5H2,1-4H3
charge 0 multiplicity 1
44 atoms
O  -4.457045 -0.688281 -0.357016
C  0.99229 1.286492 -0.420335
C  1.183219 2.500809 0.556986
C  2.023236 0.163087 -0.225427
C  -0.440441 0.727083 -0.373441
C  2.598181 3.112285 0.4175
C  0.112158 3.590959 0.319206
C  2.476552 -0.569802 -1.351568
C  2.513652 -0.224259 1.048044
C  -1.346904 0.97601 -1.437961
C  -0.910716 -0.029539 0.726704
C  3.380693 -1.644732 -1.214934
C  3.418119 -1.299972 1.186185
C  3.871653 -2.030397 0.058757
C  -2.669793 0.495902 -1.407714
C  -2.235902 -0.51729 0.780832
C  -3.121778 -0.25324 -0.294017
C  4.870865 -3.165576 0.205841
C  -4.974656 -1.480266 0.774519
C  -6.425884 -1.822561 0.447272
H  1.144192 1.693494 -1.442918
H  1.057205 2.130394 1.596385
H  2.731989 3.950611 1.126348
H  2.746248 3.511075 -0.605231
H  3.392059 2.369833 0.608173
H  -0.909698 3.206966 0.479499
H  0.170749 3.977499 -0.717326
H  0.272438 4.443657 1.004838
H  2.105777 -0.299632 -2.348617
H  2.199651 0.321832 1.945627
H  -1.011486 1.559052 -2.304664
H  -0.231022 -0.262781 1.554132
H  3.709573 -2.192622 -2.107026
H  3.779779 -1.575679 2.184986
H  -3.366684 0.686916 -2.229722
H  -2.557884 -1.100959 1.648557
H  5.911625 -2.794749 0.126392
H  4.775116 -3.665048 1.18627
H  4.734805 -3.92917 -0.580561
H  -4.362237 -2.3980 0.89525
H  -4.902538 -0.883788 1.707827
H  -6.870901 -2.417741 1.265456
H  -7.022328 -0.903344 0.317717
H  -6.485929 -2.408626 -0.485624
