program: Gaussian 09
title: 000041831
version: EM64L-G09RevD.01
frameworkgroup: C1[X(C16H23NO3)]
method: RPBEPBE
basis: SDD
operation: Freq
keyword: #p
keyword: freq=noraman
keyword: PBEPBE/SDD
title: #p freq=noraman PBEPBE/SDD
converged: YES YES NO NO
title: Mulliken charges:
elementType: O O O N C C C C C C C C C C C C C C C C H H H H H H H H H H H H H H H H H H H H H H H
charge: -0.279079 -0.285981 -0.284980 -0.088873 -0.354749 -0.371530 -0.443273 -0.448984 -0.380281 0.294096 -0.262221 -0.416000 -0.260548 -0.688420 0.200581 0.200556 -0.361446 -0.361091 -0.215607 -0.215596 0.228996 0.175059 0.183435 0.218667 0.204807 0.228728 0.224415 0.215052 0.189034 0.227998 0.202127 0.197280 0.224701 0.225959 0.210038 0.211872 0.230343 0.230434 0.240724 0.248830 0.249238 0.227784 0.227906
chargesum: 0.00000
title: Mulliken charges with hydrogens summed into heavy atoms:
elementType: O O O N C C C C C C C C C C C C C C C C
charge: -0.279079 -0.285981 -0.284980 -0.088873 0.049306 0.030571 -0.009738 -0.009516 0.036751 0.294096 0.137185 0.034660 0.161362 0.013081 0.200581 0.200556 -0.112615 -0.111853 0.012177 0.012310
polarizability: 2.03418250e+02 2.64997654e+01 1.92594002e+02 2.16715841e+00 -1.87875585e+00 1.61230167e+02
1716.lowfreq: -5.3993 -2.8089 0.0006 0.0006 0.0008 6.9339 16.0111 20.0562 21.9269
frequency: 15.9014 19.7664 21.8682 49.6097 51.4400 60.6750 73.4356 107.9498 118.4714 126.1304 154.0552 167.8647 199.3788 206.5677 246.9202 260.2920 261.7297 329.9218 336.9213 341.3543 373.8571 415.7397 453.5710 460.6139 524.2994 548.7909 549.6261 593.0246 604.9266 633.5590 651.8448 704.4937 727.0839 730.5101 744.0427 770.2742 804.4486 809.1153 817.1919 837.0072 839.8173 843.3954 866.9896 902.0788 913.6499 926.5341 940.9047 958.1434 958.7754 967.0321 1005.8114 1008.0081 1042.0412 1058.3407 1060.8084 1073.5196 1080.9702 1093.3425 1098.4917 1110.7814 1138.6410 1145.7359 1147.3062 1162.4553 1163.1301 1186.1350 1196.8451 1202.3091 1207.4565 1220.8462 1227.3043 1241.5036 1244.2637 1268.8862 1271.7466 1277.3943 1288.3473 1295.5031 1302.5106 1315.5300 1337.4215 1350.8271 1379.3028 1386.4793 1410.0284 1411.1952 1443.9111 1444.4476 1459.2604 1460.6544 1463.1633 1465.8814 1466.5711 1477.9427 1481.2150 1482.7377 1496.9875 1499.1099 1604.8333 1624.7328 2834.8016 2846.8076 2861.5202 2928.4800 2946.9971 2985.9740 2999.7435 3000.6453 3010.7026 3016.9122 3020.7231 3027.7651 3039.2171 3042.5414 3067.6817 3078.3513 3091.3668 3106.7069 3107.2559 3139.3201 3157.3164 3174.3840 3181.7278
redmass: 2.9569 4.3880 3.9887 1.9725 3.2792 3.8531 2.0167 3.5387 2.4773 3.8460 4.9732 2.9601 1.0654 2.4126 3.0149 5.6183 3.2728 2.2250 4.1122 3.4854 5.4492 3.0412 3.8150 3.1001 4.6531 4.5301 4.1782 7.4817 2.4501 4.1711 4.8422 4.8465 7.6266 3.9703 1.2312 1.4189 5.3398 1.3255 1.2904 2.0424 4.0542 1.3483 2.1021 2.5754 1.3758 3.3003 2.0948 2.0431 1.2830 1.5113 1.3669 2.0241 5.4029 2.6851 2.7829 2.4438 3.4925 1.9800 1.8675 1.4773 2.2970 2.8316 1.9870 1.1044 1.8780 1.3008 1.3650 1.5192 1.4863 1.6407 2.7924 1.2270 2.9031 1.1541 1.4202 1.1518 1.2962 1.2713 1.3104 1.4932 1.5039 1.4604 1.5293 1.2465 4.7960 1.5403 2.4540 1.0805 1.0487 1.0691 1.0850 2.6796 1.1966 1.0861 1.0806 1.0887 1.0898 1.0874 7.8904 7.9012 1.0710 1.0726 1.0694 1.0564 1.0549 1.1024 1.1066 1.0358 1.0597 1.0595 1.0678 1.0861 1.0880 1.0891 1.1039 1.1023 1.1055 1.1002 1.1005 1.0859 1.0918 1.0950 1.0992
irintensity: 0.3207 0.1325 0.1745 0.3654 0.6544 0.0850 4.0631 2.4119 2.1772 4.1715 1.5519 0.0963 0.1994 4.6995 1.2858 0.4406 6.8682 6.4070 0.5768 8.1944 1.4583 4.5946 2.8552 0.0296 0.6856 11.6571 0.4557 0.1442 1.7527 0.5904 3.0944 3.7765 14.2039 9.2535 114.1495 0.1999 90.8881 4.5091 4.6967 6.0533 7.1989 0.2759 8.9774 7.1372 6.6532 3.0545 6.3950 1.5747 0.0023 2.5445 1.6537 19.9857 65.1155 0.7229 31.6114 94.9742 72.1191 22.3488 10.2057 21.1218 58.4622 54.8471 34.0841 20.2241 5.7998 0.3358 5.5596 5.9969 10.6950 20.3133 319.7090 2.9603 16.5369 3.7754 1.1545 0.2635 8.2097 2.0071 0.0291 22.5753 21.8249 3.0429 18.6460 31.9532 10.5180 6.7437 3.5343 6.5449 9.1961 1.8779 4.5408 162.3646 42.3472 17.1162 2.0901 3.1233 1.2759 6.1501 1.4069 3.2248 76.8864 54.1056 166.4192 41.1900 56.6813 51.0057 22.1461 5.5789 19.9193 18.9608 59.5947 58.1449 11.6782 62.0018 7.8578 10.2839 75.0746 15.8615 19.2917 2.2002 19.2956 11.2556 6.3721
temp: 298.150 k
press: 1.00000 atm
elementType: 8 8 8 7 6 6 6 6 6 6 6 6 6 6 6 6 6 6 6 6 1 1 1 1 1 1 1 1 1 1 1 1 1 1 1 1 1 1 1 1 1 1 1
symmnumber: 1
zpe: 950859.0 jmol-1
zpe.correction: 0.362163 hartree
zpe.thermalcorrener: 0.382366 hartree
zpe.thermalcorrenthalpy: 0.383310 hartree
zpe.thermalcorrgfe: 0.309305 hartree
zpe.sumelectzpe: -902.340407 hartree
zpe.sumelectthermal: -902.320204 hartree
zpe.sumelectthermalent: -902.319260 hartree
zpe.sumelectthermalfe: -902.393265 hartree
dipole: -0.2662 0.2633 -0.6228
dipole: 0.7266
quadrupole: -109.6350 -113.7566 -119.3252
quadrupole: 0.4522 2.8537 -0.6240
quadrupole: 4.6039 0.4823 -5.0863 0.4522 2.8537 -0.6240
hfenergy: -902.7025703 hartree
pointgroup: C01 [X(C16H23N1O3)]
dipole: -0.1042411 0.100408 -0.2465411 debye
polarizability: 202.4063429|26.7081479|193.5426911|2.4622483|-1.745837|161.2933847 unknown
InChI: InChI=1S/C16H23NO3/c1-16(19-14-6-2-3-7-15(14)20-16)8-12-18-13-11-17-9-4-5-10-17/h2-3,6-7H,4-5,8-13H2,1H3
charge 0 multiplicity 1
43 atoms
O  -1.266578 -1.272766 -0.009493
O  2.782156 -0.55853 -1.25306
O  2.852726 -0.830225 1.136377
N  -4.760241 0.026124 0.258871
C  -6.076279 -0.611296 0.523392
C  -4.992637 0.958642 -0.87997
C  -7.055152 0.578709 0.439492
C  -6.443993 1.490202 -0.674411
C  -3.649578 -0.926643 0.07255
C  2.516199 -1.560691 -0.147714
C  -2.286327 -0.224769 0.115327
C  1.034649 -1.929247 -0.144809
C  0.09595 -0.7278 0.006447
C  3.480243 -2.732867 -0.309863
C  3.49314 0.50587 -0.653458
C  3.535247 0.34565 0.750453
C  4.07025 1.60897 -1.288509
C  4.156374 1.281088 1.582398
C  4.710103 2.569344 -0.454572
C  4.752467 2.408825 0.949928
H  -6.075833 -1.1081 1.510059
H  -6.332738 -1.380807 -0.251071
H  -4.912535 0.421769 -1.860389
H  -4.242323 1.769128 -0.882448
H  -8.085325 0.255977 0.20857
H  -7.070093 1.113826 1.404597
H  -6.448975 2.54867 -0.363779
H  -7.017924 1.418462 -1.614993
H  -3.732567 -1.491859 -0.891075
H  -3.676861 -1.668024 0.89212
H  -2.172612 0.322536 1.075529
H  -2.179169 0.504563 -0.718084
H  0.800903 -2.455348 -1.088392
H  0.851594 -2.638629 0.682911
H  0.235023 -0.013603 -0.832613
H  0.288569 -0.196565 0.962292
H  3.294061 -3.246719 -1.268309
H  3.344692 -3.452274 0.515648
H  4.522575 -2.372298 -0.297783
H  4.029061 1.724687 -2.374848
H  4.179654 1.149006 2.667378
H  5.178007 3.445891 -0.914574
H  5.252798 3.16232 1.566977
