program: Gaussian 09
title: 000041835
version: EM64L-G09RevD.01
frameworkgroup: C1[X(C20H24N2O5)]
method: RPBEPBE
basis: SDD
operation: Freq
keyword: #p
keyword: freq=noraman
keyword: PBEPBE/SDD
title: #p freq=noraman PBEPBE/SDD
converged: YES YES NO NO
title: Mulliken charges:
elementType: O O O O O N N C C C C C C C C C C C C C C C C C C C C H H H H H H H H H H H H H H H H H H H H H H H H
charge: -0.445237 -0.345856 -0.258011 -0.404306 -0.371319 -0.318518 -0.647147 -0.029255 -0.416483 -0.541925 -0.407231 -0.308078 -0.717466 0.510967 0.625763 -0.488974 -0.413975 0.208235 0.156722 -0.530454 -0.335478 -0.448131 0.165481 -0.347663 -0.194438 0.110378 0.195636 0.222600 0.199088 0.199859 0.204692 0.232314 0.239750 0.170167 0.237782 0.192661 0.216986 0.219512 0.204703 0.311778 0.240871 0.260361 0.249788 0.225924 0.333080 0.253346 0.233731 0.239230 0.383478 0.328225 0.396837
chargesum: 0.00000
title: Mulliken charges with hydrogens summed into heavy atoms:
elementType: O O O O O N N C C C C C C C C C C C C C C C C C C C C
charge: -0.112157 -0.345856 -0.258011 -0.020828 -0.371319 -0.078768 0.077915 0.193345 -0.017536 -0.104920 0.000718 -0.115417 -0.076265 0.510967 0.625763 -0.177196 -0.173104 0.208235 0.156722 -0.270094 -0.085690 -0.222207 0.165481 -0.094318 0.278523 0.110378 0.195636
polarizability: 2.47275836e+02 -3.01607830e+00 2.80053961e+02 -1.65298220e+01 -2.00561928e+01 2.11888230e+02
1716.lowfreq: -2.5200 -0.0009 -0.0003 -0.0002 4.5140 5.9865 19.0088 24.5975 29.5898
frequency: 18.9774 24.4946 29.5851 39.5336 54.1646 74.5297 79.0514 108.4805 115.0327 124.9784 138.2529 146.5136 149.8961 157.4309 171.9139 200.9080 211.6204 228.9722 254.3565 264.1289 286.3446 294.5229 307.5376 322.0229 352.0776 376.4451 390.3165 407.5831 412.9301 418.8567 428.3372 433.4237 456.5362 465.8704 485.8081 501.3573 522.0056 561.3342 562.4805 582.5326 602.5813 631.5924 636.6565 646.4391 674.8559 687.4474 698.0473 713.0888 714.3693 722.7858 767.0718 769.9978 773.1843 789.8590 819.6615 832.4075 835.2396 858.4545 888.8550 894.4890 907.6759 909.4428 922.5340 937.2805 956.7650 960.2644 963.6906 973.4485 974.6121 997.4422 1006.3029 1043.3029 1049.9866 1054.6194 1063.3508 1074.4773 1095.5501 1098.6984 1117.6541 1127.8880 1136.1267 1137.9790 1153.3028 1169.3840 1179.4449 1188.7988 1208.9557 1227.2340 1233.8278 1244.7656 1249.9901 1271.6529 1275.9317 1289.6821 1297.9338 1317.3076 1327.3089 1333.9571 1346.0455 1361.1715 1376.1881 1380.0220 1386.6799 1398.7178 1407.5666 1414.0471 1434.1524 1440.2295 1448.4953 1456.8375 1468.1739 1470.3456 1475.1459 1477.3980 1483.2330 1486.0515 1490.2727 1553.3586 1598.5319 1608.3473 1632.3494 1635.7036 1657.8861 2709.5374 2810.5833 2925.3030 2962.3355 2966.6702 2992.9836 2994.8429 2998.1553 3007.5342 3024.1415 3062.8182 3066.1867 3068.5329 3116.2656 3118.2247 3127.7252 3135.8974 3168.9451 3173.2194 3179.1454 3422.9105 3461.8064 3525.9196 3625.0413
redmass: 5.6546 5.9223 6.2004 5.6487 4.0778 4.7874 5.7258 4.8105 3.1263 3.8265 6.1201 4.0793 4.7884 4.3907 3.1875 2.4327 1.4743 2.2992 3.8432 4.2372 2.2610 3.0929 1.8108 2.8607 4.7766 4.8925 3.2549 4.1088 3.3340 3.6152 3.0430 6.0410 2.9540 3.6587 3.1991 3.5367 4.1239 2.0534 3.4134 5.3364 1.6217 3.6097 3.8457 1.9153 7.9901 1.2414 4.1466 4.6690 4.4659 3.4460 4.2531 4.4105 4.7895 1.9950 1.7090 4.5176 1.5257 2.2481 3.7266 1.8626 1.7209 1.6441 1.7465 1.3525 2.0498 1.1278 1.4572 3.5241 3.4241 2.0213 2.5537 2.3283 2.4849 3.0491 2.5083 1.5380 2.1890 1.9049 2.4624 1.5925 1.4366 1.0782 2.0104 1.2915 1.3950 1.6471 1.4360 1.3943 1.5259 3.6659 1.5144 3.5452 1.3588 1.1830 1.2547 1.3743 1.6067 1.4997 1.4663 1.2475 1.5781 1.2378 2.2106 3.6606 3.3236 1.9644 4.0394 1.1848 4.8661 1.1124 1.0949 1.0888 1.5769 1.1178 1.4363 1.6622 1.5861 3.7859 3.0132 7.5036 6.1354 2.5616 2.0054 1.0711 1.0714 1.0837 1.0560 1.0402 1.0627 1.0838 1.0627 1.0860 1.1002 1.0993 1.0998 1.0994 1.1082 1.0899 1.0910 1.0896 1.0934 1.0947 1.0955 1.0736 1.0507 1.0656 1.0999
irintensity: 0.2863 0.5644 0.1011 0.9146 0.1386 0.8548 0.1656 2.7939 4.9768 10.1354 3.9979 1.0203 0.2687 3.7622 2.9293 7.2543 0.3309 3.0759 2.7563 12.5853 53.4669 0.2123 82.0548 20.6215 0.2185 16.5188 0.9640 3.0605 2.7054 4.6618 0.9865 10.4875 11.0360 1.3480 25.9581 10.5803 12.4015 7.4679 7.2515 2.2764 5.1974 27.9296 23.0465 81.7497 2.1381 233.7888 1.9796 14.1768 15.5600 14.7194 0.8487 17.3324 11.4172 21.4795 34.7986 46.3197 74.5617 6.0231 5.4569 5.4922 36.8473 8.5450 12.4688 2.3503 10.2712 108.3384 36.0463 23.5621 162.9559 2.4936 6.7038 17.7124 14.0103 11.3491 4.2487 8.2280 14.5420 8.5406 16.9843 7.2237 7.6532 0.8724 38.3914 74.7297 20.5875 44.3217 9.3029 10.7754 19.4739 101.2634 16.2001 141.9271 2.3486 4.1114 2.0544 7.1745 57.7940 59.4575 22.0645 0.3456 38.7869 35.0850 107.1755 3.9152 64.7614 13.9036 47.6306 21.5744 143.6615 8.8813 7.8071 7.7792 47.1781 22.6466 41.8733 64.8504 90.2455 37.1732 101.8885 5.6501 17.2598 139.2151 148.2087 435.9403 140.7544 47.1508 16.6965 62.0550 112.3722 7.2882 35.4575 33.1571 31.3590 41.6334 6.8396 59.0060 23.7229 15.9734 6.5035 10.0613 2.8643 7.6319 6.9879 0.8218 254.1201 8.1729 98.9826
temp: 298.150 k
press: 1.00000 atm
elementType: 8 8 8 8 8 7 7 6 6 6 6 6 6 6 6 6 6 6 6 6 6 6 6 6 6 6 6 1 1 1 1 1 1 1 1 1 1 1 1 1 1 1 1 1 1 1 1 1 1 1 1
symmnumber: 1
zpe: 1077407.5 jmol-1
zpe.correction: 0.410363 hartree
zpe.thermalcorrener: 0.435945 hartree
zpe.thermalcorrenthalpy: 0.436889 hartree
zpe.thermalcorrgfe: 0.353880 hartree
zpe.sumelectzpe: -1260.138646 hartree
zpe.sumelectthermal: -1260.113065 hartree
zpe.sumelectthermalent: -1260.112121 hartree
zpe.sumelectthermalfe: -1260.195129 hartree
dipole: -6.8787 3.0366 3.0088
dipole: 8.0988
quadrupole: -183.3911 -140.1757 -156.5034
quadrupole: 5.1009 4.4592 -8.9411
quadrupole: -23.3677 19.8477 3.5200 5.1009 4.4592 -8.9411
hfenergy: -1260.5490093 hartree
pointgroup: C01 [X(C20H24N2O5)]
dipole: 2.1677242 -1.611262 1.6903889 debye
polarizability: 235.9761447|-4.4103738|278.4436991|24.8143427|20.2618333|224.7981834 unknown
InChI: InChI=1S/C20H24N2O5/c1-12(2-3-13-4-7-18-19(8-13)27-11-26-18)22-10-17(24)14-5-6-16(23)15(9-14)20(21)25/h4-9,12,17,22-24H,2-3,10-11,21H2,1H3
charge 0 multiplicity 1
51 atoms
O  -2.492759 -1.882475 2.397405
O  0.92585 2.159131 1.587776
O  3.159696 2.964771 1.874543
O  -3.862504 1.340439 -2.849446
O  -3.098445 3.268082 -1.431542
N  0.381291 -2.766817 0.096801
N  -1.638809 3.007654 0.329122
C  1.850054 -2.962012 0.246179
C  2.574198 -2.750939 -1.106752
C  2.293293 -1.374913 -1.778554
C  -0.337334 -2.396039 1.327347
C  -1.871651 -2.303876 1.118832
C  2.228387 -4.336127 0.862065
C  2.588076 -0.194272 -0.864172
C  -2.329532 -1.316592 0.061895
C  1.51288 0.393914 -0.132602
C  3.908501 0.293639 -0.683447
C  1.828205 1.412342 0.763718
C  3.14217 1.885996 0.943079
C  -2.166381 0.072467 0.232838
C  4.211235 1.35037 0.220974
C  -2.97322 -1.78472 -1.115651
C  -2.633225 0.998318 -0.73857
C  -3.461276 -0.898013 -2.086617
C  1.815372 2.949154 2.4900
C  -3.321939 0.501568 -1.903976
C  -2.468944 2.471329 -0.620126
H  2.192216 -2.16621 0.936938
H  3.663177 -2.866796 -0.933891
H  2.277672 -3.554823 -1.812754
H  2.901599 -1.307734 -2.70125
H  1.230039 -1.349282 -2.073989
H  -0.06019 -3.55541 -0.398272
H  -0.167222 -3.11254 2.176443
H  0.030521 -1.409134 1.669809
H  -2.244559 -3.315707 0.838294
H  1.704191 -4.505257 1.821074
H  3.315083 -4.40258 1.057347
H  1.95933 -5.160513 0.173022
H  0.492052 0.029572 -0.274548
H  4.725803 -0.156965 -1.258253
H  -1.718185 0.435429 1.16557
H  5.228992 1.729074 0.345056
H  -3.11745 -2.863436 -1.256827
H  -2.178476 -2.489491 3.117782
H  -3.979238 -1.251088 -2.982676
H  1.863244 2.4380 3.471112
H  1.437323 3.979974 2.557201
H  -3.718272 2.309921 -2.496903
H  -1.569996 4.025777 0.338217
H  -0.951543 2.477141 0.872276
