program: Gaussian 09
title: 000041828
version: EM64L-G09RevD.01
frameworkgroup: C1[X(C16H24ClNO3)]
method: RPBEPBE
basis: SDD
operation: Freq
keyword: #p
keyword: freq=noraman
keyword: PBEPBE/SDD
title: #p freq=noraman PBEPBE/SDD
converged: YES YES NO NO
title: Mulliken charges:
elementType: Cl O O O N C C C C C C C C C C C C C C C C H H H H H H H H H H H H H H H H H H H H H H H H
charge: -0.065531 -0.281556 -0.279787 -0.278261 -0.111313 0.289888 -0.416564 -0.252869 -0.684561 -0.386277 0.236730 0.187700 -0.247360 -0.323729 -0.327519 -0.352531 -0.342647 -0.671802 -0.671378 -0.073835 -0.201780 0.226787 0.227096 0.210488 0.208187 0.240770 0.232819 0.232543 0.209976 0.216176 0.202774 0.185389 0.188146 0.203981 0.189425 0.206730 0.277704 0.255823 0.205878 0.226751 0.210386 0.206335 0.226394 0.207965 0.256455
chargesum: 0.00000
title: Mulliken charges with hydrogens summed into heavy atoms:
elementType: Cl O O O N C C C C C C C C C C C C C C C C
charge: -0.065531 -0.281556 -0.279787 -0.278261 -0.111313 0.289888 0.037320 0.165807 0.021571 0.039876 0.236730 0.187700 0.140803 0.068398 0.068636 -0.074826 -0.086824 -0.028787 -0.030684 -0.073835 0.054675
polarizability: 2.22199443e+02 3.75978021e+01 2.07207501e+02 4.67519321e+00 -2.85658635e+00 1.76999606e+02
1716.lowfreq: -5.1161 -0.5517 0.0014 0.0017 0.0023 5.7277 12.7195 14.7268 23.8273
frequency: 12.5473 14.5263 23.4078 45.6807 54.0601 66.3416 81.8713 86.0254 102.6791 107.7699 124.7633 146.7583 169.3076 182.2816 190.2252 198.9056 209.6335 231.4505 269.3597 286.8820 295.6829 297.4523 313.4046 340.9265 349.6293 379.0757 385.5314 417.0578 439.3953 464.6272 472.7587 492.4898 548.8705 560.8863 562.6258 649.0886 656.0260 693.4116 722.3778 729.9227 746.0381 794.2711 797.1532 797.5686 804.2324 811.5242 816.0987 852.2691 865.9502 914.0050 917.7915 925.5923 940.6806 990.1954 1006.1022 1039.0875 1044.6395 1061.8457 1065.6927 1068.7357 1076.4997 1079.6020 1085.5943 1095.7541 1119.8464 1125.8589 1143.5942 1158.0079 1170.6468 1205.0045 1207.8734 1223.8486 1233.4010 1237.9724 1253.2407 1274.7110 1277.4036 1285.6099 1291.1775 1307.4998 1332.2066 1362.9875 1365.8798 1376.6147 1386.8412 1387.3700 1387.8740 1388.5860 1410.2933 1416.2063 1443.6404 1459.2886 1460.0685 1462.9063 1464.0645 1464.4854 1470.6546 1472.8309 1481.8309 1485.8525 1488.3969 1493.1056 1497.1779 1601.4736 1617.6593 2850.7506 2859.9748 2907.5974 2929.8846 2947.4142 2980.5048 2982.9534 2988.5379 2999.4048 3001.9071 3017.8476 3021.0804 3033.6955 3058.0796 3073.1192 3075.3429 3079.1618 3090.2740 3091.0984 3108.2372 3109.0237 3169.7332 3187.6516 3192.3558
redmass: 3.3818 7.4941 4.2377 3.8953 3.5752 2.1931 2.4097 2.2337 4.6088 2.8888 3.4852 3.9504 1.8307 2.9274 3.5524 1.2949 1.6543 1.3733 2.6945 2.6056 2.2814 3.5242 4.4816 4.6329 4.1838 3.9547 4.0515 3.0041 2.9895 3.2709 3.1820 2.9828 4.4978 4.8569 4.7273 5.5396 9.1006 4.9618 5.4661 5.1896 2.7106 1.1692 1.1415 1.3375 1.3677 2.4021 1.6765 1.3807 6.3492 2.0958 1.3266 3.2040 1.9642 2.2928 1.3675 5.2070 2.0236 2.0161 2.8736 2.1804 1.9660 3.4600 2.1425 3.0476 1.4648 1.5985 3.6258 1.5058 1.7259 1.4920 2.2432 2.8224 1.6628 2.0362 1.7593 1.1224 1.1326 1.1947 1.2512 1.4215 1.5021 1.3345 1.3859 1.4476 1.7986 2.2758 1.2396 1.2338 1.5127 3.6778 1.0794 1.0580 1.0957 1.0915 1.2222 2.2356 1.0639 1.0689 1.0638 1.0702 1.0671 1.0739 1.0778 8.2138 9.0694 1.0720 1.0715 1.0703 1.0571 1.0550 1.0358 1.0358 1.1025 1.1066 1.0359 1.0595 1.0875 1.0872 1.0919 1.0982 1.0982 1.1023 1.1003 1.1004 1.1007 1.1001 1.0892 1.0970 1.0945
irintensity: 0.1283 0.0087 0.2307 0.1082 0.2025 1.4648 0.9115 1.3157 3.7216 0.9134 1.5094 4.5073 0.5966 1.1396 0.5595 0.1272 1.5291 0.3040 3.3363 1.3668 2.5792 3.2963 1.4809 1.9473 1.5193 9.9001 1.5229 6.7364 7.1710 1.4844 0.5088 3.9295 7.4492 2.6829 13.0173 4.0941 10.3119 2.8185 19.0664 23.1561 6.5646 10.4217 5.4990 43.4841 13.9652 38.3409 42.6039 33.0599 83.8033 0.7759 1.0048 6.9099 10.5038 6.0727 1.7367 96.9281 8.1313 45.4955 117.8177 8.1524 35.7091 63.8482 2.8998 23.4489 25.7952 6.7122 120.9412 9.9819 3.8283 5.9792 36.5325 239.6029 19.5846 32.9868 38.0205 1.1152 0.4609 7.4782 26.5139 10.5685 27.7397 2.0912 0.6221 24.6958 24.1157 37.5832 21.9526 21.0536 5.5174 28.9042 8.2087 8.5288 10.6134 14.9548 85.2185 170.6630 0.5239 8.8771 13.1483 6.8529 10.5209 13.1703 4.0251 10.1043 7.1506 34.0336 174.3594 73.1038 48.8183 61.1563 29.4928 30.4949 53.4042 20.5909 4.4410 18.1679 18.1959 16.9914 34.2908 49.8297 72.3724 9.8734 31.9357 52.4385 21.0430 12.0323 1.7041 1.4766 0.8435
temp: 298.150 k
press: 1.00000 atm
elementType: 17 8 8 8 7 6 6 6 6 6 6 6 6 6 6 6 6 6 6 6 6 1 1 1 1 1 1 1 1 1 1 1 1 1 1 1 1 1 1 1 1 1 1 1 1
symmnumber: 1
zpe: 977482.2 jmol-1
zpe.correction: 0.372303 hartree
zpe.thermalcorrener: 0.395638 hartree
zpe.thermalcorrenthalpy: 0.396582 hartree
zpe.thermalcorrgfe: 0.315703 hartree
zpe.sumelectzpe: -1362.901998 hartree
zpe.sumelectthermal: -1362.878664 hartree
zpe.sumelectthermalent: -1362.877720 hartree
zpe.sumelectthermalfe: -1362.958599 hartree
dipole: -1.7039 -1.7260 0.0726
dipole: 2.4265
quadrupole: -135.3643 -133.4540 -130.0217
quadrupole: -10.1532 4.2651 0.9654
quadrupole: -2.4176 -0.5073 2.9250 -10.1532 4.2651 0.9654
hfenergy: -1363.2743014 hartree
pointgroup: C01 [X(C16H24Cl1N1O3)]
dipole: 0.6242473 -0.7207249 0.0472587 debye
polarizability: 216.7495607|-37.7490835|212.2601707|9.0903691|-1.4117926|177.396818 unknown
InChI: InChI=1S/C16H24ClNO3/c1-4-18(5-2)9-11-19-10-8-16(3)20-14-7-6-13(17)12-15(14)21-16/h6-7,12H,4-5,8-11H2,1-3H3
charge 0 multiplicity 1
45 atoms
Cl -5.553501 3.405896 -0.23588
O  -2.485442 -0.643216 1.269974
O  -2.313126 -1.578647 -0.941825
O  1.70986 -1.210815 0.506449
N  5.052937 0.437157 0.140813
C  -2.026084 -1.880321 0.516251
C  -0.523016 -2.058445 0.709493
C  0.309282 -0.850524 0.264859
C  -2.888723 -3.06099 0.950732
C  4.059404 -0.636138 0.398524
C  -3.226201 0.122295 0.349049
C  -3.127658 -0.426549 -0.951092
C  2.634678 -0.134553 0.124111
C  6.320688 -0.059424 -0.455445
C  5.262585 1.317382 1.322293
C  -3.95139 1.288101 0.611736
C  -3.751531 0.169967 -2.049504
C  6.172677 -0.437729 -1.941537
C  5.727012 2.736538 0.942953
C  -4.583336 1.883284 -0.509398
C  -4.500222 1.357874 -1.812951
H  -0.327707 -2.261705 1.778196
H  -0.199738 -2.949013 0.140078
H  0.144804 -0.637213 -0.812517
H  0.036416 0.052042 0.851832
H  -3.954819 -2.841086 0.772952
H  -2.742413 -3.261171 2.025659
H  -2.612188 -3.961885 0.377114
H  4.111146 -1.0240 1.443091
H  4.258793 -1.493699 -0.267767
H  2.521131 0.116027 -0.951981
H  2.41568 0.782403 0.715589
H  6.729925 -0.929839 0.118359
H  7.070214 0.74871 -0.372624
H  5.986188 0.862355 2.046154
H  4.297585 1.395413 1.857582
H  -4.025054 1.713414 1.614424
H  -3.66887 -0.254314 -3.053003
H  7.141032 -0.778837 -2.353441
H  5.826974 0.435718 -2.521389
H  5.441372 -1.253793 -2.087132
H  5.836264 3.362535 1.848458
H  4.990279 3.209282 0.270341
H  6.70285 2.727548 0.424444
H  -5.00876 1.859165 -2.640322
