program: Gaussian 09
title: 000005446
version: EM64L-G09RevD.01
frameworkgroup: C1[X(C10H16S)]
method: RPBEPBE
basis: SDD
operation: Freq
keyword: #pfreq=noraman
keyword: PBEPBE/SDD
title: #p freq=noraman PBEPBE/SDD
converged: NO YES NO NO
title: Mulliken charges:
elementType: S C C C C C C C C C C H H H H H H H H H H H H H H H H
charge: 0.059785 0.350685 0.328568 -0.240928 -0.514169 -0.477549 -0.441450 -0.405001 -0.788478 -0.764139 -0.807445 0.245380 0.240157 0.242888 0.215505 0.232883 0.263699 0.242788 0.234015 0.217082 0.218628 0.239944 0.216704 0.214407 0.209218 0.238348 0.228474
chargesum: 0.00000
title: Mulliken charges with hydrogens summed into heavy atoms:
elementType: S C C C C C C C C C C
charge: 0.059785 0.350685 0.328568 0.004451 -0.031123 -0.029161 0.065037 -0.405001 -0.118753 -0.093084 -0.131404
polarizability: 1.40496557e+02 -4.50519163e+00 1.06119385e+02 2.65438976e-01 1.76197628e+00 1.02136122e+02
1716.lowfreq: -10.4856 -7.4251 -0.0012 0.0006 0.0014 26.2005 82.2083 140.3003 184.5523
frequency: 82.0105 140.2597 184.5251 199.2553 201.3676 232.9314 243.6553 257.6316 283.2485 357.6762 376.4921 386.0032 428.4607 446.0489 507.8199 542.6860 582.3309 626.5076 663.4146 735.6375 808.7216 835.4792 852.9535 900.5323 918.0987 942.0075 948.9549 951.0699 987.8494 1001.7140 1022.0624 1034.0378 1074.8137 1085.8436 1110.6281 1125.6392 1160.7965 1174.1892 1192.8907 1208.8816 1217.2914 1234.3750 1257.8760 1268.4298 1291.0437 1303.5931 1316.1245 1383.3059 1390.3187 1404.0675 1434.3092 1457.2016 1462.2921 1467.4180 1472.1377 1480.5722 1486.3324 1490.3798 1500.0978 2976.3134 2979.3556 2981.5259 3003.2837 3007.8337 3015.2120 3055.3127 3057.4970 3058.8904 3062.1912 3065.5957 3075.0798 3077.6029 3079.3609 3082.8700 3088.0082
redmass: 4.5257 1.0972 1.3527 1.7064 1.2031 2.5173 2.3850 2.8887 1.9291 2.5908 2.6227 2.2614 3.6137 2.5416 2.9001 3.8186 3.4714 3.7791 3.0006 2.4839 1.4555 2.5270 2.3957 2.4965 1.7365 2.0769 1.4824 1.8574 1.4688 1.5380 2.0247 2.1953 1.4022 1.3101 1.7640 2.4400 1.8585 2.0605 1.7853 1.9611 1.7417 1.8848 2.0323 2.8510 1.5864 1.7997 2.5263 1.2032 1.2390 1.1961 1.0806 1.0573 1.0494 1.0594 1.0538 1.0634 1.0675 1.0680 1.0601 1.0368 1.0367 1.0365 1.0593 1.0611 1.0631 1.1032 1.0968 1.0989 1.0955 1.0967 1.1001 1.1007 1.0999 1.0988 1.0980
irintensity: 0.8902 0.1712 0.1954 0.1662 0.1339 1.4096 0.0662 0.4660 0.5037 0.4281 1.2682 0.6197 0.8365 0.5520 1.4508 1.0699 4.1899 0.2838 2.3646 6.9349 4.4098 0.7185 1.4611 3.9076 2.1829 4.8887 1.3482 7.0149 1.5565 14.5533 0.9748 13.3970 5.2706 13.4540 9.9703 26.8970 13.4240 1.9583 8.2186 18.4756 4.2880 1.6375 9.1404 14.9341 6.7987 18.2542 6.8640 13.3387 16.7204 29.2288 21.5742 6.2440 7.6223 17.9310 7.9678 4.1818 5.9967 15.8233 4.8070 20.3429 23.3652 44.1036 27.5526 9.5716 44.8242 3.9640 16.8444 3.2034 7.8655 79.5717 20.1499 7.7390 41.2405 64.7002 24.1151
temp: 298.150 k
press: 1.00000 atm
elementType: 16 6 6 6 6 6 6 6 6 6 6 1 1 1 1 1 1 1 1 1 1 1 1 1 1 1 1
symmnumber: 1
zpe: 614869.9 jmol-1
zpe.correction: 0.234192 hartree
zpe.thermalcorrener: 0.245523 hartree
zpe.thermalcorrenthalpy: 0.246467 hartree
zpe.thermalcorrgfe: 0.198276 hartree
zpe.sumelectzpe: -787.848362 hartree
zpe.sumelectthermal: -787.837030 hartree
zpe.sumelectthermalent: -787.836086 hartree
zpe.sumelectthermalfe: -787.884277 hartree
dipole: -3.4825 0.6561 -0.0190
dipole: 3.5438
quadrupole: -84.0594 -73.9221 -73.6327
quadrupole: 0.7737 -0.6044 0.0649
quadrupole: -6.8547 3.2826 3.5720 0.7737 -0.6044 0.0649
hfenergy: -788.0825532 hartree
pointgroup: C01 [X(C10H16S1)]
dipole: 1.340755 -0.3797786 -0.0456001 debye
polarizability: 139.3764177|-7.5115504|107.354905|-1.3440443|-1.375608|102.0207414 unknown
InChI: InChI=1S/C10H16S/c1-9(2)7-4-5-10(9,3)8(11)6-7/h7H,4-6H2,1-3H3
charge 0 multiplicity 1
27 atoms
S  -2.978372 0.430408 0.196168
C  1.008465 0.285978 0.464542
C  -0.198518 0.553194 -0.541377
C  0.693539 -1.251721 0.591571
C  0.08545 -0.536938 -1.661503
C  0.728261 -1.739365 -0.888024
C  -0.802744 -1.244832 1.015157
C  -1.369928 -0.060199 0.227087
C  2.400671 0.597267 -0.129805
C  0.877626 1.073921 1.7915
C  -0.402228 1.966351 -1.077864
H  1.354845 -1.810938 1.274068
H  0.77604 -0.103514 -2.407573
H  -0.842487 -0.810771 -2.192415
H  0.156767 -2.675485 -1.016666
H  1.759936 -1.936701 -1.227099
H  -0.941552 -1.07455 2.098868
H  -1.339778 -2.180062 0.773627
H  2.588683 0.108846 -1.100439
H  3.191291 0.265254 0.569881
H  2.52511 1.686624 -0.273602
H  -0.121092 0.991471 2.253383
H  1.068016 2.149399 1.61821
H  1.625512 0.71991 2.525874
H  0.481288 2.300503 -1.651984
H  -1.285639 2.006887 -1.73969
H  -0.582063 2.684364 -0.257596
