program: Gaussian 09
title: 000041790
version: EM64L-G09RevD.01
frameworkgroup: C1[X(C11H17N5O2S)]
method: RPBEPBE
basis: SDD
operation: Freq
keyword: #p
keyword: freq=noraman
keyword: PBEPBE/SDD
title: #p freq=noraman PBEPBE/SDD
converged: YES YES NO NO
title: Mulliken charges:
elementType: S O O N N N N N C C C C C C C C C C C H H H H H H H H H H H H H H H H H
charge: 0.233756 -0.288765 -0.270416 -0.154414 -0.163854 -0.219542 -0.042782 -0.551180 0.115373 0.098740 -0.160643 0.153849 0.205927 -0.646554 -0.615069 -0.615860 -0.353305 -0.601123 -0.386546 0.245784 0.300987 0.245850 0.282270 0.282190 0.244322 0.273036 0.244269 0.208332 0.208333 0.268556 0.249709 0.249404 0.210530 0.210541 0.269138 0.269158
chargesum: 0.00000
title: Mulliken charges with hydrogens summed into heavy atoms:
elementType: S O O N N N N N C C C C C C C C C C C
charge: 0.233756 -0.288765 -0.270416 -0.154414 -0.163854 -0.219542 -0.042782 -0.012885 0.115373 0.098740 -0.160643 0.153849 0.205927 0.146068 -0.050609 0.145768 0.063360 0.166545 0.034524
polarizability: 2.83759308e+02 -1.28281009e+00 1.90654392e+02 -9.40431428e-02 -2.93639799e-02 9.91912038e+01
1716.lowfreq: -4.6679 -0.0016 -0.0014 0.0019 2.1864 5.6263 17.9857 42.0181 43.5434
frequency: 17.4785 41.9514 43.5236 68.6140 81.3988 95.0312 103.0789 104.7176 116.5618 121.0128 126.0719 141.0026 142.9626 174.0188 213.3306 223.7597 235.8072 266.1750 275.2710 303.1208 304.4344 347.3652 368.4424 369.1879 389.6050 410.7281 437.5563 475.4751 502.4464 561.6763 583.6023 629.4666 660.6482 672.6447 690.3239 702.9468 729.7102 738.4985 742.2417 779.6296 810.6063 927.9323 958.3222 972.7283 1001.2417 1021.4739 1048.8178 1050.4769 1082.8668 1101.3186 1114.0433 1128.2298 1129.9988 1132.1020 1191.4067 1209.3817 1227.4143 1236.3340 1242.9788 1263.9850 1286.4489 1297.8407 1309.5611 1328.7917 1336.9023 1345.7106 1357.0668 1388.3115 1414.0127 1427.1400 1444.3469 1454.7975 1460.8535 1471.3788 1473.7915 1475.9710 1478.4970 1479.9216 1482.9685 1487.5004 1499.9089 1571.1874 1613.8888 1644.6582 1647.0907 2978.8912 2990.3075 2991.3166 3005.5452 3011.6520 3027.6408 3043.7317 3056.6557 3081.9945 3094.3754 3103.1405 3117.3860 3121.6373 3137.9897 3138.1645 3469.7609 3597.4791
redmass: 5.1936 1.9438 5.4243 4.3836 2.5257 2.9140 1.0667 1.1209 3.4814 1.9346 2.3540 4.6704 1.6083 5.0340 7.3978 3.2137 5.2979 1.0774 3.5753 3.6547 6.1745 4.3703 8.1722 5.3760 8.4420 5.0289 3.2685 7.3340 7.2484 1.6661 5.7223 10.2617 9.1762 11.6029 7.5518 11.2512 5.5290 9.5655 1.0961 5.6522 1.1868 3.4321 5.5600 1.2029 4.4186 3.1197 3.9833 3.2234 1.0792 3.9869 2.0672 1.3009 1.3014 1.2996 3.1655 5.8025 2.7024 1.4218 1.2054 6.0352 1.1340 6.6317 1.6374 4.3042 1.1577 4.2874 1.2788 2.9483 1.2919 1.2584 1.0965 1.7989 1.0820 1.3495 1.0459 1.0940 1.0838 1.0427 1.0995 1.0420 2.1785 7.8556 10.6523 1.0920 9.6356 1.0594 1.0599 1.0336 1.0336 1.0328 1.1022 1.0570 1.1063 1.1025 1.1025 1.1021 1.1024 1.1088 1.1010 1.1023 1.0446 1.0984
irintensity: 0.0016 0.0672 0.0492 0.2101 0.0330 8.0565 0.1025 1.6417 2.8256 0.2962 7.8291 0.6528 7.3626 7.0416 0.7668 15.1512 0.9177 54.0275 3.4377 0.5562 0.3105 13.5163 0.2499 3.4752 35.0309 9.9712 2.4947 18.0364 16.9161 402.5433 1.5080 2.6580 18.9930 0.2845 4.5672 6.2897 8.6380 11.9193 11.7787 0.5063 0.0197 6.4019 38.0349 0.3552 54.1011 71.4916 3.0529 7.7058 0.1187 37.5549 43.5227 0.4603 0.2370 0.1061 43.2902 26.5929 2.8147 0.3799 5.1375 43.8184 0.0678 13.7889 140.2505 115.9319 0.1185 145.4661 10.5220 38.2360 28.5588 38.4072 27.6704 137.2923 3.0551 87.8404 16.7839 12.8713 1.7996 17.8105 54.7453 21.2782 146.3070 5.9874 576.4580 42.7827 514.8292 5.5160 55.3199 38.4904 34.1208 32.0378 0.0310 9.7196 54.9819 16.1369 19.1597 17.9977 1.8326 16.4210 0.5007 0.8277 2.5250 1.1554
temp: 298.150 k
press: 1.00000 atm
elementType: 16 8 8 7 7 7 7 7 6 6 6 6 6 6 6 6 6 6 6 1 1 1 1 1 1 1 1 1 1 1 1 1 1 1 1 1
symmnumber: 1
zpe: 747602.6 jmol-1
zpe.correction: 0.284747 hartree
zpe.thermalcorrener: 0.305770 hartree
zpe.thermalcorrenthalpy: 0.306714 hartree
zpe.thermalcorrgfe: 0.233149 hartree
zpe.sumelectzpe: -1250.224208 hartree
zpe.sumelectthermal: -1250.203184 hartree
zpe.sumelectthermalent: -1250.202240 hartree
zpe.sumelectthermalfe: -1250.275806 hartree
dipole: 4.8564 -1.4738 -0.0062
dipole: 5.0751
quadrupole: -125.1587 -126.4345 -117.6650
quadrupole: -6.1296 0.0125 0.0046
quadrupole: -2.0726 -3.3485 5.4211 -6.1296 0.0125 0.0046
hfenergy: -1250.5089545 hartree
pointgroup: C01 [X(C11H17N5O2S1)]
dipole: -1.9032111 -0.6037096 0.0134107 debye
polarizability: 283.7064143|2.4467585|190.7009618|-1.0745608|-0.1207017|99.1975279 unknown
InChI: InChI=1S/C11H17N5O2S/c1-14-7-8(13-10(14)19-6-4-5-12)15(2)11(18)16(3)9(7)17/h4-6,12H2,1-3H3
charge 0 multiplicity 1
36 atoms
S  -2.594473 -1.560411 0.015225
O  3.270226 -2.263171 -0.021008
O  3.768791 2.429319 -0.027164
N  0.190427 -1.702593 -0.000884
N  1.579642 1.582408 -0.011677
N  3.488376 0.101305 -0.022989
N  -0.616968 0.444531 0.001937
N  -7.381721 0.875471 0.030975
C  1.306343 -0.839937 -0.006935
C  0.769881 0.457332 -0.005386
C  -0.929177 -0.883664 0.004939
C  2.716024 -1.116796 -0.017099
C  2.988635 1.434062 -0.020939
C  0.21709 -3.174738 0.002931
C  -3.570597 0.079138 0.016096
C  0.988463 2.933654 -0.009261
C  -5.073341 -0.230757 0.023718
C  4.964417 -0.020367 -0.033221
C  -5.925457 1.078293 0.023802
H  -0.297247 -3.568832 -0.891085
H  1.270336 -3.494564 -0.005458
H  -0.281738 -3.564045 0.907769
H  -3.245999 0.638161 0.908066
H  -3.254365 0.634106 -0.881408
H  0.353245 3.070993 -0.90042
H  1.816564 3.657016 -0.017668
H  0.368559 3.074652 0.892084
H  -5.337619 -0.828881 0.918299
H  -5.345718 -0.833914 -0.865042
H  5.203943 -1.093655 -0.025135
H  5.39083 0.479451 0.851718
H  5.377797 0.461745 -0.934189
H  -5.663934 1.683393 -0.865649
H  -5.655884 1.688542 0.907315
H  -7.753807 0.449185 0.884072
H  -7.761646 0.445171 -0.816628
