program: Gaussian 09
title: 000005537
version: EM64L-G09RevD.01
frameworkgroup: C1[X(C24H27N3O3)]
method: RPBEPBE
basis: SDD
operation: Freq
keyword: #p
keyword: freq=noraman
keyword: PBEPBE/SDD
title: #p freq=noraman PBEPBE/SDD
converged: YES YES NO NO
title: Mulliken charges:
elementType: O O O N N N C C C C C C C C C C C C C C C C C C C C C C C C H H H H H H H H H H H H H H H H H H H H H H H H H H H
charge: -0.276076 -0.293452 -0.297232 -0.256166 -0.208714 -0.122067 -0.392868 -0.583466 0.339066 0.457063 0.207562 0.175450 -0.397902 -0.611851 0.131428 -0.522908 0.221398 0.175228 -0.623845 -0.063435 0.367100 0.366222 0.483692 -0.619958 -0.617593 -0.836184 -0.834485 -0.530381 -0.529340 -0.821871 0.274944 0.240879 0.239179 0.239883 0.260446 0.263250 0.265613 0.245428 0.243616 0.284986 0.232455 0.232824 0.233264 0.219484 0.242620 0.242221 0.232418 0.219595 0.225510 0.260565 0.233354 0.234606 0.249294 0.227811 0.227423 0.221701 0.222214
chargesum: 0.00000
title: Mulliken charges with hydrogens summed into heavy atoms:
elementType: O O O N N N C C C C C C C C C C C C C C C C C C C C C C C C
charge: -0.276076 -0.293452 -0.297232 -0.256166 -0.208714 -0.122067 0.122955 -0.104404 0.339066 0.457063 0.207562 0.175450 -0.137456 -0.348600 0.131428 -0.257294 0.221398 0.175228 0.150185 -0.063435 0.367100 0.366222 0.483692 -0.387504 -0.384768 -0.140816 -0.140252 0.189047 0.182371 -0.150533
polarizability: 3.81941360e+02 -1.45261831e+01 3.74483575e+02 1.76154071e+00 -3.94898999e+00 2.08087273e+02
1716.lowfreq: -51.2984 -17.1138 -8.6443 -3.6759 -0.6988 -0.0002 0.0005 0.0006 19.3803
frequency: -51.2545 -16.8494 19.3147 25.9374 40.1860 51.4437 57.9063 66.1790 83.7763 97.7155 103.7625 110.7905 125.8385 127.5568 130.3456 142.3563 158.0833 158.6321 170.1266 179.5998 202.9425 215.4904 228.1843 238.3524 253.5192 264.7271 268.5642 287.6351 290.8790 301.0396 313.5292 346.7866 352.8336 357.0793 374.4627 410.2807 423.6527 463.8520 486.2166 492.5837 495.2241 500.2762 505.4764 536.9848 553.1450 563.3133 574.5362 581.8668 612.7495 626.6375 658.0870 672.2580 677.9706 697.9238 712.0131 723.3022 735.4054 747.4593 751.0250 778.1039 828.1920 834.4869 863.3840 885.1717 888.5684 895.2768 905.6102 921.8573 934.2340 937.3043 950.3846 961.3907 987.5184 1011.1376 1015.8688 1025.9760 1035.0670 1039.8033 1044.0848 1047.7174 1056.2291 1093.7570 1113.2984 1115.0819 1120.8859 1130.5070 1144.9591 1149.7852 1156.9141 1167.6342 1175.2898 1179.6582 1208.6851 1219.3929 1226.4505 1249.6442 1250.0451 1276.2355 1281.6591 1305.4157 1314.7098 1326.5724 1335.7597 1357.9535 1358.0752 1367.4646 1389.7193 1394.9604 1396.3001 1397.5427 1416.9622 1418.2481 1425.2974 1429.3256 1437.5590 1452.4563 1452.7301 1457.8484 1458.0289 1458.2256 1460.1933 1472.6118 1473.2512 1475.1330 1475.8881 1477.5831 1483.1099 1486.5150 1487.5729 1491.3051 1492.4862 1551.6004 1570.7732 1578.9248 1614.2988 1619.0930 1621.6990 1638.5448 2967.5392 2967.8509 2968.7586 2974.4735 2978.9314 2980.3490 2992.2929 3006.8585 3042.6047 3043.2731 3047.5563 3057.8672 3070.5181 3077.8591 3078.4311 3082.7182 3083.0489 3097.7046 3099.1175 3105.2835 3109.8020 3124.6997 3128.5215 3136.1855 3148.6955 3162.5174 3195.4786
redmass: 1.0131 3.6537 4.0411 4.6192 4.3910 3.8889 1.3048 2.4999 3.8254 3.8559 3.2192 3.1489 1.1084 1.6683 1.3597 2.6333 1.3152 1.1586 3.3188 3.0215 4.0087 3.6922 2.9022 4.1645 5.1248 2.5497 5.0487 3.9488 4.0146 3.5595 3.4986 4.7299 4.5208 4.0723 4.8238 4.9559 4.2248 4.4106 4.9189 4.4747 3.6847 5.8615 3.2135 5.2288 4.7893 4.2299 4.3124 3.8708 5.6988 5.5894 3.7283 4.3044 4.3702 5.4357 6.2158 6.6717 4.2776 3.3731 3.4690 5.3538 1.8336 4.0234 1.3199 3.0924 1.3173 1.6581 1.5731 2.6543 2.2288 4.9746 3.3275 3.9583 2.2795 1.7382 1.5286 2.7505 1.9071 1.5185 1.5299 1.5792 2.0534 4.1572 1.2461 1.2735 2.9611 1.3048 2.2993 1.3822 1.5736 1.6844 2.0299 2.1854 1.9621 2.2033 2.0370 1.4100 1.3613 2.0915 3.6856 3.1546 2.1559 4.5399 1.7706 3.1761 5.2078 4.7074 2.3702 1.2293 1.2783 1.2699 2.6306 1.4048 1.3568 1.6474 1.8953 1.1328 1.7991 1.0568 1.0604 1.0534 1.0692 1.0544 1.0679 1.0776 1.0578 1.0950 1.2170 2.0771 1.1208 1.5046 1.2627 8.8789 9.5516 7.1139 6.6634 6.2533 10.2273 8.0384 1.0386 1.0385 1.0383 1.0306 1.0317 1.0667 1.0658 1.0328 1.0951 1.0953 1.0943 1.0969 1.1047 1.1035 1.0995 1.0995 1.0993 1.1018 1.0953 1.0908 1.0915 1.1025 1.1034 1.1024 1.0920 1.0917 1.0918
irintensity: 0.3961 0.0771 0.0066 0.0792 0.0505 0.2346 0.1973 1.5629 1.1189 0.3813 6.4251 9.2230 0.4689 0.8610 0.8544 3.1827 0.9242 0.0263 2.1193 6.8903 1.8723 0.8637 0.0456 6.0333 9.8532 1.2438 0.7649 6.0139 2.7738 2.6722 6.6516 7.7527 2.2185 6.8807 1.2921 4.5974 6.5770 8.6581 9.5739 1.7774 1.0083 5.1962 0.5566 8.8658 11.8135 0.1965 0.4524 0.8093 13.5297 2.5838 0.5662 1.3428 12.0614 7.9453 2.0486 9.6259 15.3268 8.6944 2.9448 6.3005 12.9906 9.3049 25.4252 11.1828 0.0567 2.6803 15.3562 37.4976 2.1473 41.4386 3.3844 80.8444 31.2707 18.4042 3.8416 32.8552 0.0927 5.7466 0.5727 21.4124 6.7850 37.9352 27.5643 2.6234 20.7902 0.0931 7.7931 3.9351 17.0371 39.6484 51.2371 12.4194 65.5785 57.1651 5.3545 0.9259 14.3698 21.0538 290.3186 0.4549 17.0701 7.8717 21.8137 30.5513 4.7739 12.0589 53.5824 7.5674 18.1697 4.2473 2.2738 69.1648 88.7488 148.8145 16.4001 18.3279 53.5698 5.4432 42.9688 1.3306 6.6246 12.4132 2.0900 15.5516 4.4846 7.6464 18.9133 145.5347 4.3571 161.7436 13.9816 77.5018 531.1451 3.9100 248.4669 2.9341 125.9134 596.5241 58.2808 53.8707 5.9374 64.5729 83.4645 23.9629 33.3255 37.3166 19.1369 26.3501 29.8883 30.6942 26.3456 21.3315 16.9149 19.4642 31.8586 15.4082 4.3691 34.7192 25.6317 20.9506 22.4702 1.7721 6.7837 1.0108 6.0256
temp: 298.150 k
press: 1.00000 atm
elementType: 8 8 8 7 7 7 6 6 6 6 6 6 6 6 6 6 6 6 6 6 6 6 6 6 6 6 6 6 6 6 1 1 1 1 1 1 1 1 1 1 1 1 1 1 1 1 1 1 1 1 1 1 1 1 1 1 1
symmnumber: 1
zpe: 1208262.6 jmol-1
zpe.correction: 0.460203 hartree
zpe.thermalcorrener: 0.488653 hartree
zpe.thermalcorrenthalpy: 0.489597 hartree
zpe.thermalcorrgfe: 0.400813 hartree
zpe.sumelectzpe: -1318.511270 hartree
zpe.sumelectthermal: -1318.482820 hartree
zpe.sumelectthermalent: -1318.481876 hartree
zpe.sumelectthermalfe: -1318.570659 hartree
dipole: -5.0396 -2.8008 -0.2665
dipole: 5.7718
quadrupole: -168.2299 -177.3940 -172.9158
quadrupole: 0.8757 -3.6517 -0.0049
quadrupole: 4.6167 -4.5475 -0.0692 0.8757 -3.6517 -0.0049
hfenergy: -1318.9714727 hartree
pointgroup: C01 [X(C24H27N3O3)]
dipole: 2.0591855 0.9522972 -0.0968356 debye
polarizability: 379.7329116|-14.8868462|376.5535698|-1.9945723|6.2472866|208.2257257 unknown
InChI: InChI=1S/C24H27N3O3/c1-14-9-15(2)23(16(3)10-14)25-22-13-19-18-12-21(30-6)20(29-5)11-17(18)7-8-27(19)24(28)26(22)4/h9-13H,7-8H2,1-6H3
charge 0 multiplicity 1
57 atoms
O  -0.576692 -4.78498 0.11959
O  5.7146 1.223307 -0.28343
O  3.332791 2.740041 0.533597
N  0.595936 -2.755263 0.057632
N  -1.804622 -2.800982 0.077317
N  -3.08218 -0.818886 0.053825
C  1.876306 -3.504566 0.142832
C  2.918762 -2.863163 -0.785794
C  0.593931 -1.347473 0.022523
C  3.070115 -1.390741 -0.446684
C  1.911743 -0.667416 -0.032185
C  -0.601773 -3.519004 0.085545
C  -0.612867 -0.67685 0.008798
C  4.315238 -0.733538 -0.512513
C  -1.888727 -1.372487 0.048987
C  2.037022 0.710474 0.284083
C  4.440769 0.632016 -0.181249
C  3.275598 1.367885 0.194148
C  -3.044376 -3.608479 0.104439
C  -3.252542 0.596591 0.024135
C  -3.396904 1.269252 -1.227458
C  -3.380718 1.322239 1.247707
C  -3.781807 3.404634 -0.032385
C  -3.660621 2.659116 -1.230736
C  -3.644321 2.710941 1.195083
C  -3.283281 0.490391 -2.524518
C  -3.248518 0.599248 2.574882
C  6.239444 1.836573 0.962164
C  3.675908 3.633638 -0.599111
C  -4.038385 4.902479 -0.062176
H  1.652077 -4.546855 -0.131048
H  2.236777 -3.492264 1.190385
H  2.595576 -2.987708 -1.838802
H  3.882199 -3.392065 -0.677111
H  -0.649927 0.41016 -0.065927
H  5.220146 -1.275656 -0.80676
H  1.178509 1.302574 0.614372
H  -3.050978 -4.257202 0.995824
H  -3.096674 -4.251941 -0.789773
H  -3.885511 -2.901342 0.125594
H  -3.778307 3.169553 -2.195922
H  -3.747867 3.262359 2.139058
H  -2.251754 0.124038 -2.694511
H  -3.56597 1.114232 -3.389839
H  -3.933322 -0.404126 -2.504645
H  -3.904703 -0.290481 2.605482
H  -2.216579 0.232793 2.741559
H  -3.511025 1.261737 3.417498
H  6.423863 1.04889 1.716461
H  5.53502 2.584785 1.365371
H  7.18978 2.309499 0.673168
H  3.711756 4.646904 -0.171696
H  4.654246 3.362483 -1.036033
H  2.889903 3.579544 -1.375498
H  -3.089721 5.475199 -0.071205
H  -4.606753 5.197708 -0.962286
H  -4.609991 5.232485 0.823737
