program: Gaussian 09
title: 000005464
version: EM64L-G09RevD.01
frameworkgroup: C1[X(C10H13N2O7P)]
method: RPBEPBE
basis: SDD
operation: Freq
keyword: #p
keyword: freq=noraman
keyword: PBEPBE/SDD
title: #p freq=noraman PBEPBE/SDD
converged: YES YES NO NO
title: Mulliken charges:
elementType: P O O O O O O O N N C C C C C C C C C C H H H H H H H H H H H H H
charge: 1.402710 -0.262194 -0.511012 -0.456830 -0.689260 -0.569685 -0.253755 -0.239346 -0.168847 -0.406800 -0.099853 -0.020846 -0.505237 -0.027732 -0.349811 -0.218221 0.218329 0.239605 0.096891 -0.761978 0.280892 0.211942 0.250501 0.292485 0.303755 0.233567 0.267878 0.263574 0.363560 0.408079 0.249243 0.207108 0.251288
chargesum: 0.00000
title: Mulliken charges with hydrogens summed into heavy atoms:
elementType: P O O O O O O O N N C C C C C C C C C C
charge: 1.402710 -0.262194 -0.511012 -0.456830 -0.281181 -0.569685 -0.253755 -0.239346 -0.168847 -0.043240 0.181039 0.191096 0.037749 0.276023 0.151633 0.045353 0.218329 0.239605 0.096891 -0.054339
polarizability: 2.33862944e+02 1.43305405e+01 1.60610126e+02 1.18332452e+00 -3.95045693e+00 1.05076942e+02
1716.lowfreq: -3.7407 0.0005 0.0010 0.0015 7.0473 12.0892 24.6039 27.8453 42.4385
frequency: 24.5622 27.5475 42.3249 72.7775 79.9051 100.0615 114.4301 116.9175 124.5156 165.9147 182.7656 224.7203 233.5572 255.9305 266.4138 276.4517 308.0454 324.1143 350.4900 366.0845 372.5358 382.1534 392.9463 422.9779 466.8118 471.5421 539.0690 583.8095 589.8612 641.9538 648.5105 689.7134 696.7645 699.3525 717.9519 727.4015 752.6315 781.7046 783.4032 802.8912 835.8339 845.5930 867.1794 880.0162 920.1099 934.3757 965.4567 983.8676 1010.4573 1024.6243 1044.6003 1050.4313 1070.5177 1092.9297 1108.5779 1128.6014 1141.7530 1177.0876 1222.3426 1229.3220 1240.2103 1259.6391 1272.8483 1298.2146 1310.3373 1318.8641 1323.1606 1339.7371 1366.4499 1367.5358 1378.5816 1407.4080 1429.6038 1439.2605 1446.7654 1449.3297 1472.8461 1619.4191 1643.2269 1670.7328 2937.7022 2987.8461 3014.7775 3021.3776 3056.7968 3069.6273 3084.1686 3095.1026 3113.4384 3116.3970 3168.4839 3523.4241 3606.1885
redmass: 7.8554 5.3898 8.1608 7.8657 6.1855 3.4925 1.3077 2.0501 2.6731 7.4196 5.9554 4.3251 3.3323 3.7258 5.3661 3.5359 3.6713 3.8273 11.0514 5.2500 5.2674 6.6390 4.3706 4.9713 6.7331 3.7937 4.7639 7.7586 6.2347 4.5287 4.9558 6.8966 6.8204 3.3158 3.9321 6.1524 6.9865 2.7228 3.4556 5.9204 3.3133 3.0667 4.4054 1.4098 2.7980 2.8372 2.3734 1.2954 2.2277 2.0212 2.1453 1.4851 3.3405 2.5886 7.6333 2.7668 4.7952 1.3247 4.3204 1.1656 1.7607 1.9290 1.3090 1.2782 1.5217 1.6073 1.3291 2.0070 1.3195 1.6032 2.1004 1.2645 2.2915 1.0804 1.0958 1.0433 1.0835 6.3258 8.9565 6.2822 1.0829 1.0362 1.0643 1.0654 1.0882 1.0975 1.0873 1.1005 1.1016 1.0998 1.0927 1.0770 1.0665
irintensity: 0.9253 0.3930 0.6631 0.4873 18.5972 6.2753 23.8104 62.8025 9.0741 3.3144 6.7166 20.9761 15.2997 3.1109 20.4075 3.9438 7.3348 12.0099 48.8957 1.2694 8.4087 15.4801 13.7612 13.2132 10.8280 2.1709 13.4633 6.0685 3.6075 18.9087 46.4834 102.5570 176.8004 51.1337 6.8280 24.9753 10.0589 105.2940 110.8568 27.3561 0.7187 9.8213 73.6039 25.1812 28.5415 108.5871 88.2459 27.1221 135.0367 36.8737 24.7098 5.9493 54.7820 7.0296 239.9182 45.7386 8.4969 67.6194 10.6630 9.0623 24.5464 141.0823 26.3669 10.0235 59.0585 14.6315 26.1907 58.9247 15.9258 26.7098 22.1090 19.0382 69.0418 13.0972 20.9788 10.4221 5.3141 211.3797 267.6878 558.4799 31.6464 21.3943 32.6753 6.5367 24.5128 12.2519 1.9315 15.0149 2.0276 3.4423 5.5655 62.0408 95.8248
temp: 298.150 k
press: 1.00000 atm
elementType: 15 8 8 8 8 8 8 8 7 7 6 6 6 6 6 6 6 6 6 6 1 1 1 1 1 1 1 1 1 1 1 1 1
symmnumber: 1
zpe: 629263.8 jmol-1
zpe.correction: 0.239674 hartree
zpe.thermalcorrener: 0.259015 hartree
zpe.thermalcorrenthalpy: 0.259959 hartree
zpe.thermalcorrgfe: 0.190477 hartree
zpe.sumelectzpe: -1364.658503 hartree
zpe.sumelectthermal: -1364.639163 hartree
zpe.sumelectthermalent: -1364.638218 hartree
zpe.sumelectthermalfe: -1364.707700 hartree
dipole: 2.1502 -7.6457 3.5877
dipole: 8.7151
quadrupole: -146.2912 -125.8031 -124.2781
quadrupole: -12.9141 6.0079 1.3467
quadrupole: -14.1671 6.3210 7.8461 -12.9141 6.0079 1.3467
hfenergy: -1364.8981773 hartree
pointgroup: C01 [X(C10H13N2O7P1)]
dipole: 0.907125 -2.7128475 1.8905175 debye
polarizability: 232.9575448|16.6687908|158.7882996|0.4765678|-12.5012547|107.8041674 unknown
InChI: InChI=1S/C10H13N2O7P/c1-5-3-12(10(14)11-9(5)13)8-2-6-7(18-8)4-17-20(15,16)19-6/h3,6-8,11,15H,2,4H2,1H3
charge 0 multiplicity 1
33 atoms
P  4.261352 0.519538 -0.126056
O  0.60272 -0.697966 -0.752096
O  2.83163 0.849208 0.781471
O  3.674046 -0.55644 -1.341022
O  5.09434 -0.548529 0.963933
O  5.055724 1.773541 -0.645207
O  -1.65976 2.584592 -0.71209
O  -5.568403 0.055978 -0.281601
N  -1.465494 0.322075 -0.061217
N  -3.583304 1.265953 -0.493229
C  1.965161 -0.293503 1.20221
C  1.685509 -1.304586 0.056557
C  0.5882 0.334069 1.437518
C  0.002772 0.432592 0.005458
C  2.860957 -1.701526 -0.847829
C  -2.097869 -0.894222 0.217603
C  -2.198218 1.47599 -0.449686
C  -3.458862 -1.074008 0.17108
C  -4.306469 0.071558 -0.202592
C  -4.137765 -2.38888 0.461789
H  2.419879 -0.76795 2.088757
H  1.306006 -2.24352 0.519184
H  -0.030081 -0.323984 2.075085
H  0.673423 1.321187 1.915797
H  0.270626 1.381728 -0.484308
H  3.524412 -2.401142 -0.304507
H  2.48366 -2.172641 -1.768222
H  -1.420426 -1.721445 0.444478
H  -4.142107 2.081229 -0.765901
H  6.065102 -0.373232 1.051634
H  -4.871626 -2.276866 1.280195
H  -3.408278 -3.168033 0.742179
H  -4.706756 -2.737765 -0.418965
