program: Gaussian 09
title: 000041753
version: EM64L-G09RevD.01
frameworkgroup: C1[X(C10H23N)]
method: RPBEPBE
basis: SDD
operation: Freq
keyword: #pfreq=noraman
keyword: PBEPBE/SDD
title: #p freq=noraman PBEPBE/SDD
converged: YES YES NO NO
title: Mulliken charges:
elementType: N C C C C C C C C C C H H H H H H H H H H H H H H H H H H H H H H H
charge: -0.629585 0.337300 -0.453548 -0.421348 0.011896 -0.391613 -0.771424 -0.355086 -0.733395 -0.726417 -0.699304 0.199880 0.185786 0.175530 0.240931 0.174729 0.194319 0.189751 0.212479 0.212914 0.208917 0.262245 0.260837 0.194483 0.198110 0.198296 0.207095 0.238497 0.202703 0.240182 0.199775 0.210398 0.208519 0.216147
chargesum: 0.00000
title: Mulliken charges with hydrogens summed into heavy atoms:
elementType: N C C C C C C C C C C
charge: -0.106503 0.337300 -0.067882 -0.004887 0.186625 -0.007543 -0.137114 0.037508 -0.089507 -0.083757 -0.064241
polarizability: 1.35638264e+02 3.61604171e-01 1.11695843e+02 -9.67076019e-01 -3.85579668e-01 1.03103279e+02
1716.lowfreq: -6.5042 0.0006 0.0007 0.0008 5.6680 11.4550 36.2462 41.9976 67.2198
frequency: 35.8744 41.8115 66.9862 95.3867 117.5453 145.0111 188.9752 225.0754 227.8782 242.7025 253.1324 287.0297 298.1770 302.8102 324.2113 356.0537 369.8952 388.2549 403.8764 453.2779 475.1041 607.9504 704.4899 723.9398 742.7491 777.4650 794.1206 855.7569 887.1111 893.0562 908.8677 918.6323 951.7013 960.8055 987.1412 1006.5793 1026.0866 1047.8030 1074.5601 1088.6820 1098.3203 1117.5974 1159.5392 1202.0073 1207.2962 1225.4341 1237.8815 1277.7464 1288.1349 1297.6819 1305.9257 1320.2260 1332.8576 1345.3959 1356.2436 1366.9742 1369.6406 1378.0470 1388.3470 1389.3701 1449.7514 1455.5036 1464.1057 1464.3317 1469.3976 1475.4282 1476.6292 1477.3259 1483.1752 1486.7463 1489.7320 1503.7997 1635.8966 2929.0747 2950.7398 2957.4256 2962.2640 2966.5685 2967.1211 2970.8677 2971.5041 2975.6812 3000.2672 3001.2658 3027.1017 3051.8678 3055.9901 3057.4915 3065.9731 3066.1271 3070.1372 3072.9544 3080.8824 3089.2614 3409.6336 3531.0459
redmass: 1.9198 2.2412 2.7129 2.7363 2.1368 2.1988 2.2186 1.4019 1.1129 2.4975 1.2675 2.8275 1.5682 1.2109 1.2211 1.9019 2.1122 2.1917 2.3175 2.2630 2.4229 2.4982 1.8372 1.2828 1.7298 1.4880 2.1859 1.7257 1.8545 1.8714 1.4315 1.1922 1.4961 1.5725 1.8133 1.5355 2.6753 1.6157 2.3279 1.7649 2.0412 1.5478 2.3523 2.0810 2.0329 1.4070 1.4098 1.5050 1.2197 1.1621 1.4105 1.4262 1.4512 1.5065 1.6659 1.2889 1.2282 1.2170 1.2175 1.2317 1.0762 1.0773 1.0615 1.0508 1.0628 1.0648 1.0428 1.0630 1.0513 1.0761 1.0588 1.0548 1.0925 1.0767 1.0646 1.0555 1.0403 1.0431 1.0510 1.0364 1.0388 1.0662 1.0983 1.0973 1.1016 1.0991 1.0986 1.0985 1.0997 1.0982 1.0992 1.0966 1.0999 1.0983 1.0446 1.0953
irintensity: 0.1074 0.2450 0.0669 0.2648 0.5286 0.1458 0.2971 23.6290 0.9348 8.0430 0.0330 0.4018 0.5395 5.4233 51.9068 6.6606 1.6335 3.6006 3.1491 2.2907 8.1351 5.4385 122.0789 1.1952 44.4673 0.6270 6.0763 5.1934 1.6064 5.5861 1.6206 3.5215 0.7671 0.4919 10.6042 2.7530 2.0830 1.5415 0.4162 0.7305 15.8959 6.4107 4.4942 8.4348 13.4945 4.4831 0.0321 9.2440 1.4744 0.4747 10.7615 22.1383 6.5453 3.6742 1.2450 8.8071 20.2873 6.1726 12.6850 16.5832 2.7623 2.2257 2.6179 2.1898 1.6373 5.3086 12.3650 4.5079 21.3793 15.3603 0.6160 17.4954 52.9378 19.8047 55.1481 1.4622 30.8897 29.8037 78.0332 46.3840 11.6338 54.0633 9.4367 32.0329 28.6391 11.1593 49.1580 108.7394 45.4150 49.4186 52.1266 68.2338 15.5789 44.8938 5.6353 1.1153
temp: 298.150 k
press: 1.00000 atm
elementType: 7 6 6 6 6 6 6 6 6 6 6 1 1 1 1 1 1 1 1 1 1 1 1 1 1 1 1 1 1 1 1 1 1 1
symmnumber: 1
zpe: 822338.7 jmol-1
zpe.correction: 0.313212 hartree
zpe.thermalcorrener: 0.328262 hartree
zpe.thermalcorrenthalpy: 0.329206 hartree
zpe.thermalcorrgfe: 0.271574 hartree
zpe.sumelectzpe: -448.653551 hartree
zpe.sumelectthermal: -448.638502 hartree
zpe.sumelectthermalent: -448.637557 hartree
zpe.sumelectthermalfe: -448.695190 hartree
dipole: 0.2944 1.1194 -0.1639
dipole: 1.1691
quadrupole: -73.2007 -72.8246 -72.2100
quadrupole: -1.1398 0.5368 2.3482
quadrupole: -0.4556 -0.0795 0.5351 -1.1398 0.5368 2.3482
hfenergy: -448.9667636 hartree
pointgroup: C01 [X(C10H23N1)]
dipole: -0.093555 -0.4455924 -0.0651214 debye
polarizability: 135.391598|1.3859727|111.7790619|2.5263588|0.4173987|103.2667268 unknown
charge 0 multiplicity 1
34 atoms
N  0.523484 -0.668133 1.415343
C  0.403425 -0.829468 -0.063751
C  1.737584 -0.403451 -0.772203
C  -0.789449 0.045893 -0.56638
C  2.590157 0.816729 -0.294731
C  -2.156844 -0.198069 0.115316
C  0.146109 -2.322952 -0.452446
C  -3.27855 0.672477 -0.499836
C  3.400702 0.539786 0.998408
C  1.819001 2.15077 -0.156552
C  -4.648955 0.456636 0.177589
H  1.47869 -0.243183 -1.839847
H  2.419657 -1.28129 -0.760158
H  -0.900615 -0.12842 -1.657014
H  -0.527569 1.109919 -0.436459
H  3.337679 0.955843 -1.108042
H  -2.453235 -1.263532 0.034891
H  -2.086376 0.038735 1.197179
H  0.096853 -2.458044 -1.550444
H  -0.802079 -2.694046 -0.02137
H  0.964144 -2.962594 -0.069483
H  1.341416 -1.162959 1.793466
H  -0.328983 -0.968742 1.906188
H  -3.359946 0.447021 -1.583032
H  -2.990612 1.740934 -0.425916
H  3.93055 -0.431412 0.94479
H  4.163106 1.327435 1.151487
H  2.73674 0.535021 1.87955
H  1.268057 2.405529 -1.081515
H  1.1014 2.095462 0.680776
H  2.525135 2.977454 0.052677
H  -4.601488 0.703944 1.255056
H  -4.972927 -0.597866 0.089906
H  -5.431861 1.089374 -0.279742
