program: Gaussian 09
title: 000005443
version: EM64L-G09RevD.01
frameworkgroup: C1[X(C7H6O2S)]
method: RPBEPBE
basis: SDD
operation: Freq
keyword: #pfreq=noraman
keyword: PBEPBE/SDD
title: #p freq=noraman PBEPBE/SDD
converged: YES YES NO NO
title: Mulliken charges:
elementType: S O O C C C C C C C H H H H H H
charge: 0.093679 -0.444400 -0.245612 0.319134 -0.358830 -0.311986 -0.181082 -0.229656 -0.220626 0.121484 0.281548 0.229871 0.237982 0.235839 0.085948 0.386705
chargesum: 0.00000
title: Mulliken charges with hydrogens summed into heavy atoms:
elementType: S O O C C C C C C C
charge: 0.179627 -0.057695 -0.245612 0.319134 -0.358830 -0.030437 0.048789 0.008327 0.015213 0.121484
polarizability: 1.29146238e+02 -4.58176350e+00 1.28338852e+02 5.18270475e-02 5.18510050e-02 3.71072882e+01
1716.lowfreq: -8.2737 0.0021 0.0023 0.0031 3.0308 9.8457 67.5611 121.7207 188.1015
frequency: 67.5409 121.7165 188.1012 206.2491 291.3096 347.9189 379.5558 418.7790 426.8803 494.8998 505.8947 579.2699 599.2398 661.1419 680.0522 745.2962 758.7445 783.2932 870.1689 936.4189 966.4541 997.0543 997.2475 1034.4725 1068.4118 1130.0693 1164.1862 1178.3761 1269.9283 1324.1412 1385.2627 1418.8768 1458.4407 1566.1446 1599.7186 1629.3160 2360.6384 3126.3348 3145.7149 3163.3791 3183.9061 3534.6409
redmass: 9.2724 4.4378 10.0422 5.0664 6.2626 13.9450 1.1019 2.9579 6.7230 3.4823 7.1873 1.2197 5.0856 6.0443 4.0332 1.9177 5.5725 2.1222 1.4126 1.1349 1.3784 1.3558 5.5964 3.6803 2.6664 1.6310 1.6934 1.0669 1.4671 2.6165 10.1390 2.1352 2.4834 6.5815 6.2803 8.3677 1.0375 1.0876 1.0907 1.0952 1.0975 1.0642
irintensity: 2.1404 0.0612 3.5827 4.0576 0.9430 3.6473 11.3722 16.0747 7.6232 3.6137 14.3813 118.0170 46.4642 11.1212 59.0395 63.4045 8.9161 20.5358 0.6067 6.9486 1.8311 2.0084 248.6427 18.1026 46.3621 69.8080 82.6918 0.4185 23.0062 100.1032 1.9338 13.4013 46.3815 25.0118 16.5310 236.5298 68.4094 3.6531 10.7761 14.5268 7.7550 54.2923
temp: 298.150 k
press: 1.00000 atm
elementType: 16 8 8 6 6 6 6 6 6 6 1 1 1 1 1 1
symmnumber: 1
zpe: 291680.6 jmol-1
zpe.correction: 0.111095 hartree
zpe.thermalcorrener: 0.119949 hartree
zpe.thermalcorrenthalpy: 0.120893 hartree
zpe.thermalcorrgfe: 0.076795 hartree
zpe.sumelectzpe: -818.138086 hartree
zpe.sumelectthermal: -818.129232 hartree
zpe.sumelectthermalent: -818.128288 hartree
zpe.sumelectthermalfe: -818.172386 hartree
dipole: 2.7583 -0.9948 0.0149
dipole: 2.9323
quadrupole: -57.6037 -57.1962 -68.9944
quadrupole: 8.0865 -0.0133 0.0467
quadrupole: 3.6610 4.0686 -7.7296 8.0865 -0.0133 0.0467
hfenergy: -818.2491808 hartree
pointgroup: C01 [X(C7H6O2S1)]
dipole: -1.0422766 0.4944596 0.0067674 debye
dipolederiv: 0.3443867 0.4378761 0.0684183 0.295944 -0.3845315 -0.0205744 0.0522039 -0.0131657 -0.0729235 -0.6045877 -0.4945745 -0.0671071 -0.6343718 -1.1135717 -0.1134798 -0.0845016 -0.1073013 -0.4450128 -0.9511188 0.1376154 -0.0164239 0.0590059 -0.7292777 -0.0453474 -0.0268002 -0.041878 -0.3220716 -0.7174917 -0.19634 -0.062238 0.1047138 -0.2796611 -0.0307013 -0.0286681 -0.0454415 0.0313658 0.1871393 -0.4865383 -0.039307 -0.202544 0.8554339 0.0961267 -0.0056327 0.0801219 -0.0870838 0.2476694 0.1339148 0.0340207 -0.1806142 -0.0122915 0.0015295 -0.0022842 0.0180592 -0.1074211 -0.2259164 0.4389786 0.044284 0.2164379 -0.2343605 0.0000272 0.0188249 0.0103192 -0.125998 -0.2430456 -0.2509787 -0.0316776 -0.1579571 -0.0795278 0.0035803 -0.021518 -0.0013219 -0.1838191 0.1587574 0.0253025 0.01682 0.0356342 0.2944253 0.0476499 0.01843 0.0471557 -0.1057935 1.7286797 0.3532369 0.1198943 0.3632953 1.3954294 0.156437 0.123033 0.156759 0.2539858 0.1027808 -0.0480503 -0.0085111 -0.0411185 0.0160256 -0.0186261 -0.0073431 -0.0191412 0.1592727 0.0584952 -0.0221891 -0.0077507 -0.0833048 -0.0752164 -0.0304404 -0.0144272 -0.0268205 0.1513694 0.0278721 0.0833454 0.0021378 0.0951815 -0.0551344 -0.0202572 0.0036272 -0.0208747 0.1650982 -0.1123022 0.0074961 -0.0132505 -0.0031217 0.0884415 -0.0077931 -0.0142802 -0.0071745 0.1547106 -0.1878797 -0.2099584 -0.038435 -0.0348537 -0.0090742 -0.0176427 -0.0192269 -0.0250845 0.1327345 0.1865616 0.0908634 -0.0008741 0.1676732 0.3228908 -0.0004882 0.0085633 -0.0042114 0.4015864 unknown
polarizability: 128.0325231|-5.0699261|128.1076355|4.1799992|9.9934666|38.4522188 unknown
InChI: InChI=1S/C7H6O2S/c8-7(9)5-3-1-2-4-6(5)10/h1-4,8,10H
charge 0 multiplicity 1
16 atoms
S  0.48289 -2.656632 -0.158518
O  2.258709 1.503384 0.410363
O  2.518077 -0.786833 0.154934
C  0.271991 0.16931 0.14793
C  -0.421365 -1.069609 -0.028634
C  -0.469057 1.38106 0.246366
C  -1.839428 -1.051253 -0.100932
C  -1.871604 1.383738 0.1731
C  -2.55614 0.156465 -0.00189
C  1.748716 0.205008 0.230454
H  0.088991 2.311134 0.381398
H  -2.387838 -1.990735 -0.23593
H  -2.428063 2.322835 0.250803
H  -3.649873 0.137974 -0.061136
H  -0.685815 -3.407416 -0.294193
H  3.250309 1.44497 0.456285
