program: Gaussian 09
title: 000041771
version: EM64L-G09RevD.01
frameworkgroup: C1[X(C14H22O2)]
method: RPBEPBE
basis: SDD
operation: Freq
keyword: #pfreq=noraman
keyword: PBEPBE/SDD
title: #p freq=noraman PBEPBE/SDD
converged: YES YES NO NO
title: Mulliken charges:
elementType: O O C C C C C C C C C C C C C C H H H H H H H H H H H H H H H H H H H H H H
charge: -0.273523 -0.264330 -0.524691 -0.474749 0.460360 -0.304167 -0.304769 -0.827798 0.414181 -0.408284 -0.796715 -0.798485 0.267084 -0.334652 -0.077968 -0.732867 0.222691 0.193444 0.208483 0.202869 0.213855 0.253712 0.224261 0.230187 0.229962 0.216918 0.238415 0.211842 0.226086 0.229535 0.246906 0.216833 0.208734 0.253235 0.253143 0.234050 0.231232 0.234981
chargesum: 0.00000
title: Mulliken charges with hydrogens summed into heavy atoms:
elementType: O O C C C C C C C C C C C C C C
charge: -0.273523 -0.264330 -0.108557 -0.063397 0.460360 -0.090311 -0.051056 -0.143387 0.414181 0.047049 -0.129253 -0.126012 0.267084 -0.081417 0.175174 -0.032604
polarizability: 2.17362655e+02 -2.28717330e+01 1.39386397e+02 2.89547005e+00 2.58544935e-01 1.34831633e+02
1716.lowfreq: -17.3808 -9.7048 -3.3978 -0.0003 0.0004 0.0005 10.7120 23.8016 36.5059
frequency: 7.8340 23.1876 36.4547 43.1366 47.4280 56.2344 88.2728 104.9939 127.6668 135.7890 143.7284 154.4612 186.3779 200.8349 205.6660 225.3571 247.9880 306.4035 327.2857 337.7015 353.9706 381.5168 394.6326 409.1777 459.0320 491.3193 506.6949 534.0436 557.6396 658.1195 675.0211 736.4023 777.2585 810.9177 833.8686 842.0946 864.5911 892.1733 906.1914 927.8299 948.1831 962.7407 972.9114 984.3663 990.8216 994.5644 998.1720 1037.0715 1045.6774 1053.3347 1084.6136 1095.0008 1098.9825 1124.0046 1152.7254 1153.7359 1199.0841 1208.5339 1235.4666 1249.5878 1289.2871 1292.3181 1296.6873 1323.2413 1334.9574 1357.9034 1371.5041 1387.7040 1393.3851 1393.5793 1397.7021 1448.9168 1455.2573 1457.0432 1457.1673 1459.1189 1464.1157 1469.6228 1472.1367 1472.6243 1479.2492 1479.9196 1613.5132 1668.2475 1681.4801 1694.9106 2954.5559 2964.6174 2966.3523 2969.3717 2969.9106 2982.5830 3026.2944 3030.7263 3032.7195 3036.2795 3037.4824 3042.5231 3045.4518 3072.0212 3078.8821 3085.1759 3088.2194 3094.9117 3109.1676 3110.9547 3128.3626 3148.3628
redmass: 3.8948 3.7089 3.8117 4.2993 2.9847 2.7809 2.3332 1.0891 2.7999 2.4531 1.0792 2.1474 1.5123 1.6656 1.9215 4.1345 3.4399 2.4116 3.8249 2.2986 2.5146 2.9401 2.6954 2.3942 2.5314 2.7723 2.4621 2.9830 2.2346 3.4480 4.8074 2.5357 3.0452 4.4138 1.3294 1.8804 2.1583 2.1202 1.8682 1.7979 1.3955 2.2959 1.8110 2.4296 1.0826 1.3066 1.8912 1.5258 1.8208 1.5943 1.6695 2.0194 1.9080 2.3967 1.7831 2.5510 1.1718 1.8104 1.9382 1.2641 1.4277 1.3248 1.3874 1.3574 1.3641 1.4247 1.3551 1.3279 1.2749 1.2700 1.2273 1.1094 1.0563 1.0703 1.0484 1.0606 1.0708 1.0824 1.0774 1.0571 1.0744 1.0813 10.0256 5.8171 6.6519 6.4567 1.0372 1.0382 1.0568 1.0436 1.0373 1.0611 1.0970 1.0992 1.0614 1.0970 1.0959 1.0958 1.0985 1.0938 1.0949 1.0966 1.0960 1.0967 1.0937 1.0963 1.0967 1.0920
irintensity: 0.2731 0.1201 1.4102 1.6644 0.2751 0.5827 0.6714 0.3123 2.0228 0.6560 0.1505 1.0012 0.6289 1.7204 0.2142 4.7173 3.5683 1.9771 3.1707 6.0923 1.2557 2.1889 0.7907 2.7427 8.8575 12.8318 2.0930 5.2737 7.6116 13.8402 7.7701 4.3942 0.3099 16.2580 20.3858 4.3459 7.4827 0.7113 34.0619 10.5037 0.2746 145.8030 63.2149 14.1226 67.3426 7.5635 6.0705 4.3930 9.1800 0.3772 8.9268 118.0676 2.5248 2.6456 22.7838 147.9700 3.5314 18.4910 2.1241 14.2686 79.9231 1.4116 13.6362 2.0666 11.4245 0.0969 2.7064 18.5537 23.7666 24.8501 3.5253 17.7779 0.8880 2.5458 20.8476 6.2185 44.3481 27.2069 6.1883 5.3664 23.6709 17.4924 149.8926 110.0433 16.7957 5.4787 34.6159 30.5148 32.6260 32.1682 15.7337 88.9638 20.3100 13.6545 35.2118 41.5996 16.3474 18.0044 31.7861 7.0167 59.9020 10.5525 34.6367 24.8673 14.6515 2.2071 20.1027 8.0318
temp: 298.150 k
press: 1.00000 atm
elementType: 8 8 6 6 6 6 6 6 6 6 6 6 6 6 6 6 1 1 1 1 1 1 1 1 1 1 1 1 1 1 1 1 1 1 1 1 1 1
symmnumber: 1
zpe: 850517.3 jmol-1
zpe.correction: 0.323945 hartree
zpe.thermalcorrener: 0.343983 hartree
zpe.thermalcorrenthalpy: 0.344927 hartree
zpe.thermalcorrgfe: 0.271815 hartree
zpe.sumelectzpe: -695.837846 hartree
zpe.sumelectthermal: -695.817809 hartree
zpe.sumelectthermalent: -695.816864 hartree
zpe.sumelectthermalfe: -695.889976 hartree
dipole: -0.0391 1.0239 1.7702
dipole: 2.0453
quadrupole: -82.0578 -99.3716 -100.0132
quadrupole: -8.6276 -2.6096 -3.6010
quadrupole: 11.7564 -5.5574 -6.1990 -8.6276 -2.6096 -3.6010
hfenergy: -696.1617913 hartree
pointgroup: C01 [X(C14H22O2)]
dipole: -0.0603688 0.468599 -0.651387 debye
polarizability: 198.7322014|39.0669994|156.6575816|10.7100682|5.092876|136.1909023 unknown
InChI: InChI=1S/C14H22O2/c1-5-7-14(15)16-11-10-13(4)9-6-8-12(2)3/h5,7-8,10H,6,9,11H2,1-4H3
charge 0 multiplicity 1
38 atoms
O  1.320147 -1.117218 -0.751092
O  2.160518 -1.037837 1.434061
C  -3.243865 -1.149749 0.496737
C  -3.560386 0.348022 0.140581
C  -2.062854 -1.71278 -0.284238
C  -2.534047 1.315321 0.694836
C  -0.831914 -1.797414 0.301641
C  -2.371799 -2.127797 -1.711832
C  -1.516322 1.932493 0.027349
C  0.437771 -2.280628 -0.341162
C  -0.546844 2.848452 0.757713
C  -1.226657 1.758115 -1.453095
C  2.132188 -0.58566 0.259961
C  2.926083 0.54818 -0.271819
C  3.801331 1.22671 0.521477
C  4.655931 2.384406 0.081459
H  -3.049008 -1.216159 1.583611
H  -4.151782 -1.752417 0.287468
H  -4.554386 0.587592 0.568767
H  -3.660313 0.449954 -0.956139
H  -2.616252 1.503555 1.777331
H  -0.72113 -1.461154 1.340805
H  -2.902352 -1.316151 -2.246375
H  -3.04869 -3.004987 -1.722239
H  -1.475036 -2.381019 -2.299491
H  0.279097 -2.815331 -1.288903
H  1.025687 -2.900685 0.358514
H  -0.565651 3.871386 0.330645
H  -0.780894 2.920691 1.834215
H  0.49399 2.479919 0.656576
H  -0.282409 1.194608 -1.591485
H  -2.019666 1.208793 -1.986671
H  -1.096824 2.741521 -1.946443
H  2.776912 0.803858 -1.326471
H  3.88957 0.898896 1.568448
H  4.445038 3.281858 0.695497
H  4.49512 2.641159 -0.979288
H  5.729498 2.153598 0.226851
