program: Gaussian 09
title: 000041697
version: EM64L-G09RevD.01
frameworkgroup: C1[X(C7H14O)]
method: RPBEPBE
basis: SDD
operation: Freq
keyword: #pfreq=noraman
keyword: PBEPBE/SDD
title: #p freq=noraman PBEPBE/SDD
converged: YES YES NO NO
title: Mulliken charges:
elementType: O C C C C C C C H H H H H H H H H H H H H H
charge: -0.308016 -0.081923 -0.058902 -0.398978 -0.408003 -0.350213 -0.678347 -0.686615 0.217470 0.215817 0.204644 0.207342 0.213098 0.216022 0.196632 0.205050 0.217665 0.211953 0.222120 0.211789 0.213465 0.217930
chargesum: 0.00000
title: Mulliken charges with hydrogens summed into heavy atoms:
elementType: O C C C C C C C
charge: -0.308016 0.135547 0.156915 0.013008 0.021117 0.051469 -0.026609 -0.043431
polarizability: 9.20442685e+01 1.39540032e+00 7.39436966e+01 2.77647899e+00 6.66533712e-01 6.67018123e+01
1716.lowfreq: -0.0011 -0.0010 0.0002 5.4523 11.8546 20.8945 57.0229 79.8311 100.4268
frequency: 56.8628 79.7978 100.3844 103.8351 197.2109 220.8025 233.8103 290.7759 326.1744 385.2690 441.4143 488.5712 732.8710 736.3011 766.0789 818.8760 867.6347 893.7394 902.1341 985.3797 1008.4454 1038.4901 1048.8365 1073.3176 1100.6356 1128.4458 1139.9492 1164.9564 1221.3998 1227.5558 1250.3803 1274.2609 1290.4093 1312.1841 1335.6947 1349.3981 1391.4440 1391.7740 1447.2395 1467.3464 1472.4346 1475.1517 1478.4531 1479.0997 1487.1496 1487.2909 2969.4573 2975.1463 2979.0167 2983.5044 2991.9819 3012.2952 3038.9120 3041.1608 3057.7481 3065.4046 3072.8128 3075.1283 3078.6084 3081.6876
redmass: 2.4920 1.8208 2.2033 2.8398 1.3060 2.3350 1.1292 1.9004 2.7410 3.7946 5.6340 2.6819 1.9052 1.9618 1.5630 1.5535 1.9061 1.7318 1.4989 2.0393 1.1564 1.6819 2.3075 1.9455 1.9101 1.7839 2.0479 2.1003 1.3649 1.2965 1.2363 1.2707 1.1349 1.3259 1.3408 1.5524 1.2124 1.2131 2.9298 1.0776 1.0705 1.0596 1.0433 1.0417 1.0831 1.0886 1.0580 1.0372 1.0356 1.0600 1.0608 1.0995 1.0978 1.0986 1.0948 1.0924 1.1005 1.0994 1.0993 1.0995
irintensity: 0.1411 0.1272 0.6564 2.3183 0.1314 2.0915 0.0490 0.1496 0.8468 3.4481 14.4676 4.6717 5.4617 1.0035 21.7780 20.1790 15.1197 4.7493 9.9203 13.3125 5.5387 4.6419 5.2377 4.7957 5.0136 0.4812 1.7143 1.1714 1.0202 0.5149 0.2293 0.8744 0.4490 4.6062 2.6636 1.9999 11.4768 9.1417 7.6467 1.9956 6.6029 4.6427 13.9581 11.7234 14.0212 17.4897 22.1418 29.2800 30.1580 50.7447 26.3998 3.8136 4.2364 13.0268 3.7375 13.2248 68.0463 46.9513 126.2276 47.8422
temp: 298.150 k
press: 1.00000 atm
elementType: 8 6 6 6 6 6 6 6 1 1 1 1 1 1 1 1 1 1 1 1 1 1
symmnumber: 1
zpe: 511957.0 jmol-1
zpe.correction: 0.194994 hartree
zpe.thermalcorrener: 0.205074 hartree
zpe.thermalcorrenthalpy: 0.206018 hartree
zpe.thermalcorrgfe: 0.159295 hartree
zpe.sumelectzpe: -349.656769 hartree
zpe.sumelectthermal: -349.646689 hartree
zpe.sumelectthermalent: -349.645745 hartree
zpe.sumelectthermalfe: -349.692468 hartree
dipole: -0.6048 2.6102 -0.1612
dipole: 2.6842
quadrupole: -48.5795 -58.3214 -48.8525
quadrupole: 3.6756 0.6090 0.6124
quadrupole: 3.3383 -6.4036 3.0653 3.6756 0.6090 0.6124
hfenergy: -349.8517633 hartree
pointgroup: C01 [X(C7H14O1)]
dipole: -0.2479315 1.0252616 -0.0508593 debye
dipolederiv: -0.5985672 0.0551799 0.0350644 0.0703462 -0.7586999 0.025065 0.0015433 0.0226708 -0.3021582 0.4179102 -0.0424856 -0.0323635 -0.0943635 0.1947777 -0.0647388 -0.0821082 0.0303471 0.2670238 0.3104901 0.0864032 -0.0603974 0.1457059 0.2825514 0.0470154 -0.0514879 -0.0568188 0.2613643 -0.0838378 0.0857749 0.0555692 0.0592115 0.0478365 0.0444445 0.0301301 0.0149821 0.0930622 0.0356906 -0.0651857 0.0622975 -0.0408467 0.0160007 -0.0105939 0.016816 0.0022982 0.0914493 0.0226868 0.0147662 0.0193765 -0.0418176 0.1010396 0.0082371 0.0759346 0.0047605 0.1626008 0.0131795 -0.0424931 -0.0022351 -0.0039009 -0.0323974 0.0002372 0.0414147 0.0232003 0.0899732 -0.0390489 0.0224167 0.0315185 0.0649958 0.0584765 0.0061003 0.0110794 0.0065267 0.0843077 -0.0151069 0.0156255 0.0364111 0.0103695 0.0718543 0.0648102 0.0304274 0.0643369 -0.1359945 0.0126356 -0.0352724 0.0696331 -0.0385551 0.0341337 -0.0574451 0.0626798 -0.0625156 -0.1259571 0.054649 0.0198211 -0.0102793 0.0153241 0.0543422 0.029484 0.0265761 0.0667502 -0.1393286 -0.0551138 -0.0926089 -0.0631198 -0.0872404 -0.058236 -0.0674804 -0.0547384 -0.0943136 0.0330532 0.0755599 -0.0197146 -0.0008442 -0.005055 0.0199002 -0.0671305 0.0621852 -0.0669366 -0.1260447 -0.1196985 0.0425718 -0.0894532 0.0557669 0.0069486 0.0480539 -0.1042612 0.0704206 0.0254135 0.0447931 0.0023788 0.0510954 0.0093471 0.0441512 0.0458048 0.0397955 0.0820367 -0.1770445 -0.0336454 -0.1021108 -0.059581 -0.0857846 -0.0765612 -0.066686 -0.0716694 -0.0949599 0.017326 -0.0417441 0.1079486 -0.111036 0.0695993 0.027649 0.0312987 -0.1156883 0.0557335 0.0082692 0.100841 0.0327103 0.049646 0.0148077 0.0425808 -0.0435516 0.0284318 -0.0984687 -0.1474413 -0.1239884 -0.1243215 0.0694482 -0.1122983 0.0035784 0.0230321 0.0772255 0.0391816 0.0774903 -0.0090762 -0.0712615 -0.040258 -0.1333136 -0.036131 -0.0966074 -0.0729448 -0.0997365 0.0178867 0.0592753 0.0025529 -0.0039356 -0.0240824 0.082999 0.0666038 0.0594723 0.0494646 -0.1663434 -0.0278838 0.1073043 -0.006557 0.1517843 -0.1267944 0.0340468 -0.0108137 0.0410398 0.091092 unknown
polarizability: 91.9862861|1.5341702|73.9533216|2.9162336|0.799353|66.7501698 unknown
InChI: InChI=1S/C7H14O/c1-3-5-7-6(4-2)8-7/h6-7H,3-5H2,1-2H3
charge 0 multiplicity 1
22 atoms
O  0.91636 -1.815127 0.044923
C  0.041813 -0.686075 -0.471208
C  1.19103 -0.376064 0.441282
C  -1.400771 -0.672064 -0.003013
C  2.488862 0.231217 -0.058643
C  -2.078571 0.699223 -0.249553
C  2.475398 1.7752 0.0443
C  -3.560093 0.710296 0.183789
H  0.198122 -0.493548 -1.544773
H  0.945653 -0.178112 1.49707
H  -1.434986 -0.923675 1.074831
H  -1.966599 -1.465176 -0.531869
H  2.650239 -0.083725 -1.106936
H  3.333289 -0.178344 0.529185
H  -2.005918 0.957791 -1.325571
H  -1.522881 1.485796 0.299426
H  1.664924 2.208792 -0.570254
H  2.322323 2.106681 1.088492
H  3.43263 2.20118 -0.305723
H  -4.14206 -0.046322 -0.375371
H  -3.659783 0.479514 1.261099
H  -4.025882 1.696443 0.004316
