program: Gaussian 09
title: 000005438
version: EM64L-G09RevD.01
frameworkgroup: C1[X(C8H8N3S)]
method: RPBEPBE
basis: SDD
operation: Freq
keyword: #p
keyword: freq=noraman
keyword: PBEPBE/SDD
title: #p freq=noraman PBEPBE/SDD
converged: NO NO NO NO
title: Mulliken charges:
elementType: S N N N C C C C C C C C H H H H H H H H
charge: 0.334334 0.081571 -0.614834 -0.605592 0.569966 -0.214484 -0.522834 -0.302289 -0.289549 0.453759 -0.131986 -0.329459 0.251007 0.272791 0.263446 0.279088 0.367426 0.390612 0.378393 0.368634
chargesum: 1.00000
title: Mulliken charges with hydrogens summed into heavy atoms:
elementType: S N N N C C C C C C C C
charge: 0.334334 0.081571 0.143204 0.141435 0.569966 -0.214484 -0.522834 -0.051282 -0.016758 0.453759 0.131460 -0.050371
polarizability: 2.25367954e+02 -4.23258957e+00 1.22773933e+02 -2.69032378e-03 -2.53904668e-03 4.53987249e+01
1716.lowfreq: -83.5997 -0.0016 0.0015 0.0028 4.5812 10.8158 14.1760 88.7895 157.4942
frequency: -83.4955 88.7695 157.4932 173.1461 262.1937 326.1735 347.4958 356.3086 427.3203 427.9704 451.5193 470.3912 533.9416 535.6608 589.1607 613.2643 619.5527 664.6510 668.2862 697.1830 714.5710 753.3383 799.6989 845.7078 873.4036 950.1345 998.2908 1019.4542 1032.9814 1050.5831 1063.2895 1110.6908 1127.3178 1211.0465 1244.9100 1317.1247 1353.5011 1374.0468 1426.6891 1467.2569 1530.0917 1553.7780 1570.4898 1584.3783 1667.0079 1683.3104 3148.7921 3156.3601 3166.5409 3189.2196 3507.8501 3532.4738 3636.4555 3664.5842
redmass: 3.1141 5.3867 4.6815 5.1449 4.5566 5.1333 5.2543 1.1140 3.6619 6.9382 3.3232 8.8393 2.3893 3.1534 1.2479 1.3074 4.6941 1.6398 5.0094 7.9516 2.7749 3.3825 1.3827 6.4264 1.6699 1.4187 1.4024 3.4468 2.4828 1.7434 2.5574 2.1695 1.4950 1.4137 1.8050 2.5389 7.6330 2.5896 2.4320 3.5807 5.2334 3.7281 3.0166 5.9565 1.5889 1.1966 1.0955 1.0907 1.0930 1.0996 1.0485 1.0492 1.1041 1.1032
irintensity: 0.7674 7.2173 1.4301 2.7706 0.1341 5.9487 7.3333 0.5052 9.5544 1.3349 6.4148 9.2197 0.0150 1.7771 5.4340 86.4589 2.1009 159.7347 2.1775 2.1707 350.3627 9.0013 18.5930 2.7342 59.7101 1.0000 0.4494 0.7761 7.7308 0.1506 5.6023 31.2298 1.2249 51.1208 0.8023 15.0013 19.0304 23.1850 20.8587 18.5943 345.5723 424.0011 233.1041 2.3568 330.9341 291.4431 2.9251 0.6000 1.3485 3.7846 171.8651 197.3014 85.4620 62.1341
temp: 298.150 k
press: 1.00000 atm
elementType: 16 7 7 7 6 6 6 6 6 6 6 6 1 1 1 1 1 1 1 1
symmnumber: 1
zpe: 399169.0 jmol-1
zpe.correction: 0.152035 hartree
zpe.thermalcorrener: 0.161495 hartree
zpe.thermalcorrenthalpy: 0.162439 hartree
zpe.thermalcorrgfe: 0.117325 hartree
zpe.sumelectzpe: -870.900230 hartree
zpe.sumelectthermal: -870.890771 hartree
zpe.sumelectthermalent: -870.889827 hartree
zpe.sumelectthermalfe: -870.934941 hartree
dipole: 8.4015 4.4172 0.0051
dipole: 9.4919
quadrupole: -4.2056 -58.2473 -80.1411
quadrupole: -2.3295 0.0066 -0.0322
quadrupole: 43.3257 -10.7160 -32.6098 -2.3295 0.0066 -0.0322
hfenergy: -871.0522657 hartree
pointgroup: C01 [X(C8H8N3S1)]
dipole: -3.3249045 -1.7002472 0.0024717 debye
dipolederiv: -0.3029658 0.1110148 -0.0001527 0.2816421 -0.0673016 0.0001627 0.0004485 -0.0000603 0.1282269 -0.9198478 0.1977122 -0.0002779 -0.1035753 -0.2873051 0.0001256 0.0000776 0.0000913 -0.1718838 -1.0040035 0.413192 0.0013962 0.6604135 -0.8390574 -0.0005466 0.001662 -0.0004394 -0.5626791 -0.9678783 -0.4061921 -0.0015564 -0.7579941 -0.8636018 -0.0005539 -0.0018479 -0.0003441 -0.5720968 -0.6816002 -0.1662786 0.0001543 -0.1563819 -0.2799189 0.0004127 0.0001271 0.0002457 0.0818765 -1.6152581 0.1339779 -0.0002168 0.4752565 0.3193584 -0.0008763 -0.0007116 -0.0004261 -0.1731855 0.8983288 -0.219949 0.0004114 0.2344254 0.1658551 -0.0001901 -0.0001917 -0.000201 -0.0050043 0.8755401 0.1572122 -0.0001965 -0.2637839 -0.0935186 -0.0001103 -0.0003341 -0.0001829 -0.0729945 0.4549323 0.1380099 -0.000124 -0.1217748 0.1967851 -0.00029 0.0003204 -0.0002717 -0.0903742 2.6558494 -0.0157176 -0.0000859 0.0669707 1.3616344 0.0028014 0.0000155 0.0023491 0.3458407 -0.1424865 -0.2234177 0.000256 -0.4804503 -0.2932379 0.0002277 0.0005977 0.0002643 -0.074235 0.4209429 -0.0621788 0.0000908 0.2339914 0.4709664 -0.0005281 -0.0002653 -0.000479 -0.0144973 0.0697239 -0.0441746 -0.0000023 -0.0852234 -0.01089 0.000208 0.0001453 0.000192 0.1825077 0.0917745 -0.0351158 0.0000236 0.0077133 -0.0081076 0.0001724 -0.0000475 0.0001599 0.1581527 0.008251 0.0549717 -0.0000708 0.0646831 0.07773 0.0000941 -0.0001127 0.0000821 0.1697497 0.0003483 -0.0260355 0.0000201 -0.0369563 0.0866657 0.000057 -0.0000051 0.0000377 0.1413639 0.3532001 -0.0987045 -0.0002796 -0.0707649 0.2187883 -0.0004706 -0.0007185 -0.0003849 0.3891197 0.273304 -0.0499508 -0.0000726 -0.1493112 0.3228102 -0.0000732 -0.0005226 -0.0001314 0.3731924 0.1820313 0.0470378 0.0002714 0.1413215 0.3056931 -0.0001208 0.0006278 -0.0000254 0.3736965 0.3498135 0.0945863 0.0004115 0.0597985 0.2166522 -0.0005014 0.000735 -0.0004758 0.3932238 unknown
polarizability: 225.2587091|-5.3954327|122.8831718|0.0070385|-0.0214416|45.3987309 unknown
InChI: InChI=1S/C8H8N3S/c9-7(10)6-4-5-2-1-3-11-8(5)12-6/h1-4H,9-10H2
charge 1 multiplicity 1
20 atoms
S  -0.590411 1.606607 -0.002239
N  2.177086 1.407379 -0.001759
N  -3.617542 1.063023 0.002287
N  -3.524396 -1.271824 -0.002735
C  0.84243 -0.684563 0.000264
C  -1.428718 -0.012147 -0.000712
C  1.011548 0.744189 -0.001122
C  -0.533641 -1.08487 0.000665
C  2.036717 -1.466274 0.001156
C  -2.882116 -0.075958 -0.000417
C  3.268795 -0.793569 0.000573
C  3.300813 0.63462 -0.000909
H  -0.82616 -2.140364 0.002334
H  1.989442 -2.559968 0.002285
H  4.212793 -1.344924 0.001229
H  4.252864 1.174163 -0.001429
H  -4.63888 1.057768 0.00193
H  -3.164919 1.978869 0.005208
H  -3.002274 -2.146112 -0.005915
H  -4.542731 -1.345344 -0.001594
