program: Gaussian 09
title: 000041692
version: EM64L-G09RevD.01
frameworkgroup: C1[X(C11H18)]
method: RPBEPBE
basis: SDD
operation: Freq
keyword: #p
keyword: freq=noraman
keyword: PBEPBE/SDD
title: #p freq=noraman PBEPBE/SDD
converged: YES YES NO NO
title: Mulliken charges:
elementType: C C C C C C C C C C C H H H H H H H H H H H H H H H H H H
charge: -0.185427 -0.434703 -0.438718 -0.434281 -0.217296 -0.219191 -0.192975 -0.138145 -0.198676 -0.690522 -0.690103 0.201767 0.209480 0.205193 0.213368 0.205644 0.211542 0.210318 0.217341 0.248703 0.199724 0.205057 0.229171 0.224869 0.211536 0.204423 0.204350 0.211420 0.226132
chargesum: 0.00000
title: Mulliken charges with hydrogens summed into heavy atoms:
elementType: C C C C C C C C C C C
charge: 0.016341 -0.020031 -0.019707 -0.012421 0.000044 0.029512 0.006750 0.066912 0.030495 -0.049694 -0.048202
polarizability: 1.63455489e+02 2.69341313e-01 1.01940541e+02 -1.05194571e+01 4.62336837e-01 9.32084315e+01
1716.lowfreq: -8.3517 -0.0002 -0.0002 0.0004 4.3862 13.7619 27.9719 66.2366 76.2311
frequency: 27.8847 66.2117 76.2002 103.1246 160.0540 201.3096 218.4634 240.9026 247.5519 307.3063 338.7470 392.6039 422.7500 448.5878 479.5777 513.9165 560.0719 705.2470 726.4337 806.8575 832.1380 843.0856 851.1609 890.2050 913.7714 922.4341 941.7989 951.3431 973.2960 977.7261 981.2635 999.3123 1068.7800 1087.3980 1099.3370 1107.9874 1128.5171 1137.6526 1173.2568 1182.8776 1224.9449 1234.1451 1253.4236 1278.0510 1293.3599 1294.8490 1300.7071 1328.4458 1334.9514 1342.3701 1349.2050 1371.5322 1379.5096 1389.6613 1453.7847 1463.4296 1464.6604 1466.9435 1476.0541 1477.1763 1485.7430 1662.0421 1674.0079 2950.9547 2961.2301 2968.2308 2971.1607 2978.2608 2981.4160 2982.9377 3007.8409 3039.4510 3046.7931 3049.4324 3059.7574 3067.8525 3075.8044 3076.1274 3080.7197 3087.3190 3120.3562
redmass: 2.8870 3.0741 2.9956 2.7842 2.3418 1.0341 2.2299 1.6758 1.4403 2.1474 1.9157 2.7285 2.2489 2.6176 3.1156 3.2265 2.9897 1.8337 1.4873 3.3162 1.9341 2.6358 1.5883 2.2140 1.1820 2.2953 1.7578 1.4386 1.1366 1.2751 2.5943 1.8607 1.6770 2.0024 1.9654 2.4816 1.4252 1.0606 1.7320 1.7224 1.3654 1.2634 1.2121 1.3104 1.4161 1.4009 1.3928 1.3236 1.4992 1.5423 1.4475 1.1990 1.5361 1.2098 1.0882 1.0847 1.0450 1.0516 1.0896 1.0475 1.0548 6.8211 6.7137 1.0641 1.0775 1.0349 1.0353 1.0840 1.0667 1.0662 1.0916 1.0985 1.1033 1.0909 1.0998 1.0986 1.0891 1.1004 1.0992 1.0838 1.0990
irintensity: 0.0690 0.2089 0.3812 0.1121 0.1851 0.0013 0.1031 0.4607 0.3026 1.0048 0.2876 0.1294 0.8441 1.1318 4.0383 1.1604 5.1962 22.6696 32.8622 0.2880 2.9440 2.7266 2.7183 12.7034 0.7828 3.2498 32.0511 1.0662 47.7903 7.9443 5.9396 4.4534 3.9995 0.4045 0.4999 5.9484 4.7458 0.1726 8.0430 4.3900 2.7410 0.0652 2.7023 0.5146 1.0617 2.5272 1.0986 1.4591 1.0532 2.1329 5.8703 16.4198 0.5180 9.1859 7.4102 10.8205 3.8030 3.3494 9.5235 11.9319 16.6678 2.6937 0.5379 46.8645 15.5955 32.9176 45.8527 16.1772 49.0345 20.1529 46.8140 50.8868 64.8745 8.1774 1.2137 85.3844 55.0558 27.6463 54.8963 8.4193 53.4360
temp: 298.150 k
press: 1.00000 atm
elementType: 6 6 6 6 6 6 6 6 6 6 6 1 1 1 1 1 1 1 1 1 1 1 1 1 1 1 1 1 1
symmnumber: 1
zpe: 679549.4 jmol-1
zpe.correction: 0.258827 hartree
zpe.thermalcorrener: 0.271126 hartree
zpe.thermalcorrenthalpy: 0.272070 hartree
zpe.thermalcorrgfe: 0.219773 hartree
zpe.sumelectzpe: -429.062162 hartree
zpe.sumelectthermal: -429.049862 hartree
zpe.sumelectthermalent: -429.048918 hartree
zpe.sumelectthermalfe: -429.101215 hartree
dipole: 0.0637 -0.3124 -0.1283
dipole: 0.3437
quadrupole: -65.9585 -70.1489 -68.2044
quadrupole: -0.8255 -1.1290 0.3462
quadrupole: 2.1455 -2.0450 -0.1005 -0.8255 -1.1290 0.3462
hfenergy: -429.3209884 hartree
pointgroup: C01 [X(C11H18)]
dipole: 0.0233374 0.1241879 0.0481344 debye
polarizability: 163.36587|0.6940885|101.9631228|10.7877809|0.4231857|93.2754693 unknown
InChI: InChI=1S/C11H18/c1-10(2)8-9-11-6-4-3-5-7-11/h4,6,8-11H,3,5,7H2,1-2H3
charge 0 multiplicity 1
29 atoms
C  0.795693 -0.010769 -0.792806
C  1.678513 1.268092 -0.668911
C  2.529192 1.258865 0.622713
C  3.498766 0.053273 0.631981
C  1.602918 -1.256734 -0.432411
C  -0.463938 0.065465 0.063691
C  2.809906 -1.227791 0.193991
C  -2.995756 0.032986 0.435552
C  -1.733992 -0.033968 -0.407743
C  -3.880792 1.23388 0.006465
C  -3.793726 -1.295065 0.33437
H  0.467127 -0.107303 -1.848993
H  1.03489 2.167025 -0.70658
H  2.359273 1.31443 -1.543102
H  1.861838 1.198083 1.504851
H  3.096193 2.204632 0.71575
H  3.932872 -0.083168 1.642767
H  4.360094 0.255272 -0.040853
H  1.147616 -2.221786 -0.694961
H  -0.302632 0.195319 1.145501
H  3.330587 -2.17383 0.401619
H  -2.698079 0.179721 1.493915
H  -1.893868 -0.177603 -1.490592
H  -3.334114 2.188348 0.109289
H  -4.797124 1.28814 0.624067
H  -4.191282 1.131535 -1.051258
H  -4.097836 -1.489143 -0.712361
H  -4.711905 -1.251215 0.950118
H  -3.185335 -2.151593 0.675832
