program: Gaussian 09
title: 000005482
version: EM64L-G09RevD.01
frameworkgroup: C1[X(C16H13Cl3N2OS)]
method: RPBEPBE
basis: SDD
operation: Freq
keyword: #p
keyword: freq=noraman
keyword: PBEPBE/SDD
title: #p freq=noraman PBEPBE/SDD
converged: YES YES NO NO
title: Mulliken charges:
elementType: Cl Cl Cl S O N N C C C C C C C C C C C C C C C C H H H H H H H H H H H H H
charge: -0.045891 -0.032082 0.018188 0.357083 -0.294479 -0.101155 -0.098096 -0.114952 -0.460881 0.570942 -0.383328 -0.358593 -0.349316 -0.147918 0.749524 -0.207383 -0.202700 -0.226375 -0.111778 -0.348678 -0.226153 -0.792572 -0.551367 0.236102 0.254955 0.249397 0.226163 0.217619 0.286468 0.281704 0.258858 0.284305 0.264048 0.252549 0.272424 0.273367
chargesum: 0.00000
title: Mulliken charges with hydrogens summed into heavy atoms:
elementType: Cl Cl Cl S O N N C C C C C C C C C C C C C C C C
charge: -0.045891 -0.032082 0.018188 0.357083 -0.294479 -0.101155 -0.098096 0.121150 0.043471 0.570942 0.060453 -0.358593 -0.062847 0.133786 0.749524 0.051475 0.081605 0.037673 -0.111778 -0.096128 0.046271 -0.792572 -0.278000
polarizability: 2.88742787e+02 3.37786115e+01 2.61898180e+02 -1.59746090e+01 3.73828516e+01 1.28559432e+02
1716.lowfreq: -6.8893 -6.2005 -1.6373 -0.0030 -0.0025 -0.0022 7.4704 12.9244 21.1513
frequency: 6.8029 12.8870 21.0695 30.5735 36.0249 49.9030 55.2641 81.1492 106.4408 126.4483 143.7926 164.3357 165.8485 182.6862 200.2499 229.1843 251.8861 294.4032 303.1734 319.5250 336.7407 365.0527 375.3929 411.4844 431.4156 447.8369 454.3220 485.5367 526.4886 555.9208 579.3829 625.0302 635.7879 644.2746 652.8330 666.8021 682.7004 710.5828 726.2466 737.4163 758.4852 774.2056 776.5681 828.4035 842.2092 844.2752 859.6349 865.4371 879.2074 895.5544 905.8288 960.4435 972.4625 980.6591 1006.1622 1009.1315 1020.0516 1036.6734 1055.8609 1061.0751 1081.3970 1106.8602 1109.2480 1132.8321 1180.7477 1192.3275 1206.2654 1218.7873 1235.5050 1242.9500 1261.8754 1276.4167 1305.1015 1337.7479 1350.3807 1357.0856 1366.1791 1371.3654 1378.9460 1384.3381 1433.9739 1450.9458 1463.8472 1470.0143 1479.3511 1479.7416 1566.3881 1569.0345 1592.8745 2958.5239 2967.3487 3022.0728 3023.7038 3088.0804 3150.5646 3174.3254 3178.0035 3183.3829 3225.1435 3228.4139 3241.3906 3260.6412
redmass: 10.2029 9.6369 10.3034 7.6055 8.5936 6.7141 4.6861 6.1227 6.5424 7.7310 6.0002 7.1500 6.3252 12.2414 5.4586 6.3645 6.6964 4.9747 5.7495 6.4161 2.7769 7.2121 9.2509 6.0746 6.8099 3.9294 4.9226 3.8576 5.2842 4.3330 4.1413 3.3807 4.5654 7.1115 3.5772 3.2461 5.5623 4.6583 1.7199 1.2779 4.5160 2.4134 2.1366 2.1727 1.6139 1.6860 2.9308 1.4148 6.1754 1.3541 3.5914 4.8214 2.9984 1.3654 3.2424 3.6475 2.8992 3.1938 1.7513 3.4630 2.5030 1.7319 1.2313 1.4645 1.6861 1.1983 1.9849 1.6825 1.3852 1.5266 1.7345 1.3797 1.3719 3.6431 1.6170 2.0823 2.3755 2.6179 4.9134 1.9364 1.8256 2.6330 1.7664 5.8974 1.1456 2.6440 8.0288 7.0362 7.4922 1.0596 1.0834 1.0603 1.1028 1.1039 1.0893 1.0933 1.0958 1.0940 1.0931 1.0971 1.0998 1.1078
irintensity: 1.7109 0.7447 0.2102 0.8112 2.0718 1.8287 0.1088 1.9045 0.6646 2.0760 1.7943 0.3035 0.0911 1.7937 0.8074 4.0587 0.8080 7.1899 0.4243 1.0330 0.7046 5.5589 2.0079 8.1412 1.2240 16.1085 0.4357 15.6630 7.5763 16.9746 8.2719 15.9145 9.8197 1.2425 15.2547 25.1836 4.1320 8.4054 71.4005 10.5109 42.8124 37.7861 79.5743 27.5493 3.1623 9.4644 16.4717 15.7683 12.3602 10.1498 28.0715 76.9102 39.2186 6.6700 56.0101 32.7191 45.4660 55.5738 47.6313 20.9994 21.0616 14.3012 0.6921 9.3161 3.0937 10.6265 6.0527 31.9411 27.9388 5.1472 33.6398 9.8637 23.7497 0.7701 6.7499 21.4461 3.0515 13.0816 7.3603 1.7136 64.0701 74.0664 18.4921 36.7526 5.2954 19.9094 36.9815 7.9586 52.3837 31.1954 14.3908 24.8233 16.4390 5.6569 0.0673 0.9743 0.8605 0.8986 5.7623 0.5748 0.5374 1.6193
temp: 298.150 k
press: 1.00000 atm
elementType: 17 17 17 16 8 7 7 6 6 6 6 6 6 6 6 6 6 6 6 6 6 6 6 1 1 1 1 1 1 1 1 1 1 1 1 1
symmnumber: 1
zpe: 666734.8 jmol-1
zpe.correction: 0.253946 hartree
zpe.thermalcorrener: 0.275860 hartree
zpe.thermalcorrenthalpy: 0.276804 hartree
zpe.thermalcorrgfe: 0.196276 hartree
zpe.sumelectzpe: -2578.773709 hartree
zpe.sumelectthermal: -2578.751795 hartree
zpe.sumelectthermalent: -2578.750850 hartree
zpe.sumelectthermalfe: -2578.831379 hartree
dipole: -0.1431 -2.9236 -0.5074
dipole: 2.9708
quadrupole: -153.9192 -194.6003 -161.9505
quadrupole: -9.1230 -0.9578 -0.1079
quadrupole: 16.2375 -24.4436 8.2062 -9.1230 -0.9578 -0.1079
hfenergy: -2579.0276545 hartree
pointgroup: C01[X(C16H13Cl3N2O1S1)]
dipole: -0.6955487 0.8673059 0.3606313 debye
polarizability: 310.2025877|5.8184831|226.091819|-17.6326836|53.0240073|142.9059918 unknown
InChI: InChI=1S/C16H13Cl3N2OS/c17-12-1-2-13(14(18)7-12)15(8-21-5-4-20-10-21)22-9-11-3-6-23-16(11)19/h1-7,10,15H,8-9H2
charge 0 multiplicity 1
36 atoms
Cl -1.800345 -2.911235 -2.043052
Cl -6.202906 -0.987193 0.720331
Cl -0.9926 4.291779 0.310688
S  2.02385 4.947768 0.59131
O  0.497577 0.334808 0.189939
N  1.998716 -2.212918 0.262578
N  3.872607 -3.109307 -0.657044
C  -0.101052 -0.929162 -0.250961
C  0.583078 -2.031161 0.597734
C  -1.61594 -0.939353 -0.042446
C  0.345097 1.43388 -0.798055
C  -2.484215 -1.786117 -0.767689
C  -2.202951 -0.103071 0.94155
C  3.061565 -1.368256 0.61761
C  1.19538 2.582477 -0.336336
C  2.540965 -3.245132 -0.508123
C  -3.875939 -1.820606 -0.558479
C  -3.591937 -0.106006 1.186024
C  -4.408254 -0.967903 0.427977
C  4.203021 -1.936556 0.047054
C  2.646091 2.545837 -0.328749
C  0.720538 3.79752 0.129912
C  3.242258 3.703928 0.128366
H  0.132124 -1.112982 -1.321557
H  0.48046 -1.76046 1.663999
H  0.06143 -2.989493 0.433609
H  -0.719713 1.726936 -0.879385
H  0.689952 1.068815 -1.788205
H  -1.542084 0.562567 1.506672
H  2.902202 -0.475118 1.214445
H  1.936035 -4.052883 -0.914985
H  -4.517946 -2.485619 -1.140799
H  -4.029268 0.547132 1.945766
H  5.231401 -1.586716 0.101393
H  3.208924 1.66771 -0.656546
H  4.298278 3.944092 0.233156
