program: Gaussian 09
title: 000041779
version: EM64L-G09RevD.01
frameworkgroup: C1[X(C12H30N6)]
method: RPBEPBE
basis: SDD
operation: Freq
keyword: #pfreq=noraman
keyword: PBEPBE/SDD
title: #p freq=noraman PBEPBE/SDD
converged: YES YES NO NO
title: Mulliken charges:
elementType: N N N N N N C C C C C C C C C C C C H H H H H H H H H H H H H H H H H H H H H H H H H H H H H H
charge: -0.303529 -0.288925 -0.339274 -0.339320 -0.288912 -0.303469 -0.440004 -0.341076 -0.359266 -0.417587 -0.382730 -0.373161 -0.373183 -0.382748 -0.417532 -0.359289 -0.341077 -0.440080 0.198318 0.229718 0.211932 0.188273 0.178252 0.214349 0.227410 0.184372 0.191217 0.202569 0.215735 0.202243 0.202251 0.215744 0.202577 0.191223 0.227392 0.184373 0.178259 0.214347 0.188256 0.211940 0.229732 0.198317 0.290496 0.245608 0.265080 0.265084 0.245593 0.290502
chargesum: 0.00000
title: Mulliken charges with hydrogens summed into heavy atoms:
elementType: N N N N N N C C C C C C C C C C C C
charge: -0.013033 -0.043317 -0.074195 -0.074236 -0.043319 -0.012967 -0.011968 0.059129 0.033335 -0.005806 0.011056 0.044818 0.044811 0.011052 -0.005767 0.033318 0.059120 -0.012032
polarizability: 2.05939783e+02 1.88174025e+00 1.78943303e+02 -3.79963176e+00 -5.52682866e-01 1.39362297e+02
1716.lowfreq: -5.2980 -0.0007 0.0003 0.0007 7.1859 11.9953 28.0148 42.4916 55.7863
frequency: 28.0148 42.4143 55.7483 72.2887 78.7610 89.6018 98.7100 112.1370 129.8156 142.7171 175.7598 183.5229 192.3855 195.3654 201.4643 233.4668 240.2533 251.9443 302.3010 309.6351 310.0745 364.2633 386.7586 408.7510 427.0303 455.3279 501.2805 532.6018 560.3376 573.6787 633.5924 636.0989 679.5488 680.3712 682.2267 684.8709 802.8322 806.1842 810.4933 814.8769 856.7029 863.0889 894.9994 905.2372 908.9121 910.5952 994.6358 1004.7739 1030.1418 1035.8520 1042.1635 1042.4898 1046.5204 1056.0247 1101.0011 1101.4742 1110.5071 1112.9173 1130.9542 1135.6983 1140.6957 1150.4677 1151.0466 1155.9553 1162.7972 1171.9345 1190.3030 1193.3224 1199.9697 1208.7868 1229.5914 1234.7401 1246.6506 1260.8103 1269.5804 1269.7988 1283.7107 1297.0111 1306.6072 1318.4343 1333.7527 1342.3257 1348.1076 1348.1372 1356.8740 1360.1035 1363.1281 1366.6968 1385.6996 1388.0068 1434.1588 1436.2305 1446.8592 1447.0862 1452.4616 1453.1367 1457.2888 1458.4143 1464.0592 1467.3627 1480.6908 1481.8694 1489.9308 1490.3825 1498.0113 1498.2445 1500.4687 1501.6777 2845.9424 2846.0839 2855.9284 2856.3978 2863.6367 2865.0300 2893.3168 2893.5545 2904.2065 2905.0972 2973.0850 2973.1796 2977.5269 2977.6200 2982.0711 2982.1913 2996.3796 2996.5503 3001.7554 3004.2051 3042.5588 3042.6362 3045.9130 3046.0087 3394.2267 3394.2985 3432.9120 3433.2037 3447.3650 3447.3821
redmass: 3.3382 4.4605 4.6018 3.9811 2.5158 3.1663 2.1059 1.7763 3.7724 2.8857 2.7430 3.1779 2.4661 2.5920 3.2781 3.1721 2.6604 3.1034 2.2171 2.6394 1.9008 2.7944 3.0577 2.8942 2.4705 2.5295 2.3416 2.2591 2.4192 2.2108 1.3448 1.3683 1.4257 1.4281 1.4009 1.3784 1.3866 1.6285 1.1667 1.3706 1.5914 1.7155 2.2821 2.3503 2.1953 2.1546 2.0870 2.0049 2.1262 1.9935 2.1440 2.0829 2.5878 2.4905 2.0718 2.2519 2.1766 2.1786 1.8609 2.4501 2.6842 2.2759 3.3641 3.2260 1.7256 1.3944 2.6578 1.5301 1.5431 1.3020 1.2494 1.2495 1.2887 1.2589 1.1105 1.1454 1.2424 1.2987 1.2415 1.2515 1.3418 1.2893 1.2638 1.2486 1.3265 1.3329 1.3116 1.2753 1.4602 1.4280 1.1854 1.1748 1.1491 1.1600 1.1667 1.1626 1.1468 1.1584 1.1876 1.1809 1.0851 1.0790 1.0785 1.0828 1.0825 1.0835 1.0873 1.0855 1.0714 1.0715 1.0701 1.0703 1.0709 1.0710 1.0705 1.0706 1.0679 1.0681 1.0647 1.0648 1.0854 1.0853 1.0862 1.0861 1.0847 1.0849 1.0937 1.0936 1.0913 1.0912 1.1011 1.1010 1.0734 1.0734 1.0750 1.0750 1.0748 1.0748
irintensity: 1.1472 0.0000 0.0000 1.5224 0.3892 0.0000 0.3350 0.0000 9.8135 0.0000 9.9925 0.0002 0.0001 17.4954 0.0005 0.0002 10.1972 2.4754 1.3745 4.3994 0.0017 0.0000 0.0000 7.6500 0.0000 14.4582 20.7873 0.0000 0.0000 22.0803 0.2856 228.5374 0.0084 192.2767 0.0643 184.0765 0.0005 11.3705 5.1522 0.0001 0.0000 16.3995 15.9977 0.0000 0.0001 25.2012 0.0000 17.3617 2.4695 0.0000 0.0007 5.1257 8.1337 0.0000 2.9301 0.0003 0.0000 14.8833 0.0000 19.4669 0.0006 76.5915 0.0034 124.7757 29.8410 0.0000 0.0001 24.4622 13.6778 0.0000 24.2307 0.0000 0.0000 26.3209 0.0029 14.3277 4.1702 0.0000 0.0000 2.9426 14.7071 0.0000 0.0829 9.1040 0.0001 18.3444 0.0001 2.0055 3.4660 0.0000 0.0015 61.7101 0.0070 20.1396 0.0009 5.4691 55.9235 0.0030 100.4117 0.0000 6.5127 0.0002 0.0015 18.2764 0.0551 16.9690 0.0007 16.4094 117.9986 3.6871 0.0001 25.4585 0.0252 278.5896 191.5585 0.0188 0.0084 289.4000 75.5990 0.3428 0.0553 3.7913 144.0836 0.5804 218.3664 0.0737 195.4338 0.0067 71.1419 11.4169 3.6766 72.8669 12.6783 0.4024 0.2066 44.2849 0.5087 1.0194
temp: 298.150 k
press: 1.00000 atm
elementType: 7 7 7 7 7 7 6 6 6 6 6 6 6 6 6 6 6 6 1 1 1 1 1 1 1 1 1 1 1 1 1 1 1 1 1 1 1 1 1 1 1 1 1 1 1 1 1 1
symmnumber: 1
zpe: 1142349.0 jmol-1
zpe.correction: 0.435098 hartree
zpe.thermalcorrener: 0.455809 hartree
zpe.thermalcorrenthalpy: 0.456754 hartree
zpe.thermalcorrgfe: 0.385434 hartree
zpe.sumelectzpe: -802.187522 hartree
zpe.sumelectthermal: -802.166810 hartree
zpe.sumelectthermalent: -802.165866 hartree
zpe.sumelectthermalfe: -802.237186 hartree
dipole: 0.0002 -0.0002 0.0010
dipole: 0.0011
quadrupole: -122.1048 -104.8537 -116.8109
quadrupole: -6.9529 -9.5701 -6.4331
quadrupole: -7.5150 9.7361 -2.2211 -6.9529 -9.5701 -6.4331
hfenergy: -802.6226196 hartree
pointgroup: C01 [X(C12H30N6)]
dipole: -0.0000988 -0.0001014 -0.0004037 debye
polarizability: 205.7057612|-2.015247|178.9646826|-5.3733556|0.1832861|139.5749397 unknown
InChI: InChI=1S/C12H30N6/c1-2-14-5-6-16-9-10-18-12-11-17-8-7-15-4-3-13-1/h13-18H,1-12H2
charge 0 multiplicity 1
48 atoms
N  -3.844211 0.293967 -0.493431
N  -1.34775 2.038331 -0.308059
N  -2.367751 -2.171745 -0.383355
N  2.367865 2.171829 0.382566
N  1.34762 -2.038185 0.308303
N  3.84397 -0.293675 0.49367
C  -3.824699 1.75955 -0.36318
C  -3.861313 -0.511411 0.734433
C  -2.606791 2.362389 0.393871
C  -3.635316 -1.994722 0.369582
C  -0.114942 2.327255 0.449965
C  -1.128979 -2.081136 0.424548
C  1.128838 2.080993 -0.424929
C  0.115037 -2.327211 -0.450055
C  3.635235 1.994527 -0.370689
C  2.606843 -2.362262 -0.393267
C  3.861427 0.511044 -0.734651
C  3.82445 -1.759291 0.364114
H  -4.748506 2.084946 0.156291
H  -3.848887 2.191219 -1.381444
H  -4.844306 -0.414896 1.239524
H  -3.092807 -0.201983 1.486042
H  -2.609783 1.998428 1.453371
H  -2.726263 3.463693 0.436691
H  -4.46411 -2.323187 -0.284217
H  -3.668028 -2.603263 1.305424
H  -0.0172 1.723884 1.388162
H  -0.144155 3.39215 0.760432
H  -1.113726 -2.792033 1.284303
H  -1.067513 -1.062312 0.85832
H  1.067241 1.062077 -0.858454
H  1.113333 2.791704 -1.284833
H  0.144421 -3.392079 -0.760604
H  0.017469 -1.723764 -1.388223
H  4.464145 2.323459 0.282716
H  3.667674 2.602522 -1.306899
H  2.610148 -1.998461 -1.45283
H  2.72639 -3.463564 -0.435866
H  3.093109 0.201177 -1.486262
H  4.84454 0.414327 -1.239478
H  3.848176 -2.190518 1.382584
H  4.748449 -2.084944 -0.15485
H  -3.179848 -0.101925 -1.172868
H  -1.359968 1.059877 -0.636107
H  -2.381992 -3.030722 -0.948862
H  2.382292 3.03101 0.947756
H  1.359742 -1.059724 0.636342
H  3.17923 0.102453 1.172603
