program: Gaussian 09
title: 000041689
version: EM64L-G09RevD.01
frameworkgroup: C1[X(C10H9ClN2O2)]
method: RPBEPBE
basis: SDD
operation: Freq
keyword: #p
keyword: freq=noraman
keyword: PBEPBE/SDD
title: #p freq=noraman PBEPBE/SDD
converged: YES YES NO NO
title: Mulliken charges:
elementType: Cl O O N N C C C C C C C C C C H H H H H H H H H
charge: -0.055827 -0.209034 -0.238584 -0.332630 -0.401491 -0.172542 0.170138 0.224133 0.477165 -0.664169 -0.338415 -0.333718 -0.208947 -0.210001 -0.113582 0.267088 0.336297 0.224463 0.256198 0.231878 0.287175 0.289698 0.257272 0.257436
chargesum: 0.00000
title: Mulliken charges with hydrogens summed into heavy atoms:
elementType: Cl O O N N C C C C C C C C C C
charge: -0.055827 -0.209034 -0.238584 -0.332630 -0.065193 0.094546 0.170138 0.224133 0.477165 0.048370 -0.051240 -0.044021 0.048325 0.047435 -0.113582
polarizability: 2.11631139e+02 5.81400212e+00 1.30381622e+02 2.28148296e+00 9.47266793e+00 6.89946897e+01
1716.lowfreq: -9.4674 -4.5921 -2.2812 0.0021 0.0022 0.0024 32.5693 45.4271 79.1400
frequency: 32.4604 45.4105 79.1400 119.6179 133.4767 183.9778 216.2779 228.8551 258.0503 260.3348 338.5392 386.4148 392.0930 407.0090 417.0513 482.7124 492.1912 508.3144 592.1248 610.5636 622.3018 651.9361 699.5563 708.7009 713.0104 735.7525 816.2202 828.1214 871.3087 945.5877 952.3967 959.0411 995.2393 1015.3573 1041.9976 1078.1171 1091.5556 1119.5201 1127.7536 1158.6685 1196.2309 1219.5083 1277.6546 1303.6117 1316.2450 1350.7960 1372.1011 1375.1816 1393.0305 1406.5727 1471.2537 1474.7063 1484.0275 1584.1441 1602.2311 1648.2841 1716.9413 2988.2259 2996.3816 3098.1089 3109.5491 3167.7959 3168.6643 3197.5864 3199.6469 3610.3256
redmass: 4.1997 5.4251 6.6354 5.6900 7.6732 7.7393 1.0454 5.7727 5.8884 8.0461 5.8801 7.7679 4.7676 2.9669 4.9891 2.0219 1.7965 3.3101 4.3787 8.8723 7.0307 5.7041 5.0144 4.5815 7.6801 4.5719 1.2519 1.5974 3.9220 1.3707 1.9596 1.3690 4.7629 3.8155 2.3488 2.5863 2.6457 1.7669 1.3920 2.6453 1.1585 3.7213 1.7212 1.2851 1.5521 5.5537 7.3707 1.6499 1.3102 3.0282 1.0507 1.0593 2.4330 7.7848 6.0015 10.8663 10.1214 1.0832 1.0352 1.1010 1.1010 1.0911 1.0908 1.0946 1.0960 1.0800
irintensity: 0.2768 2.4436 3.5665 0.1443 0.8829 1.7035 0.3601 2.2578 4.3811 1.7548 0.5323 20.4268 6.4238 1.0247 23.1290 95.0085 46.3040 30.2993 16.1634 13.6805 1.5709 12.1218 7.9178 8.2854 22.1232 5.3896 0.4740 80.5474 36.2687 3.2729 0.8072 0.0801 28.5648 13.7471 39.5327 36.5688 22.6941 23.0406 9.3780 99.3542 5.5107 64.4734 23.6606 6.5378 42.4167 340.7672 1.0310 18.4482 17.5991 10.9144 18.1315 4.6861 232.6367 7.1692 0.0547 450.2194 184.9743 14.9279 21.9490 21.1029 14.4412 2.4844 1.2137 0.5667 1.9749 70.5231
temp: 298.150 k
press: 1.00000 atm
elementType: 17 8 8 7 7 6 6 6 6 6 6 6 6 6 6 1 1 1 1 1 1 1 1 1
symmnumber: 1
zpe: 460834.8 jmol-1
zpe.correction: 0.175523 hartree
zpe.thermalcorrener: 0.188821 hartree
zpe.thermalcorrenthalpy: 0.189765 hartree
zpe.thermalcorrgfe: 0.134378 hartree
zpe.sumelectzpe: -1105.439092 hartree
zpe.sumelectthermal: -1105.425794 hartree
zpe.sumelectthermalent: -1105.424849 hartree
zpe.sumelectthermalfe: -1105.480237 hartree
dipole: -5.1199 -0.0464 0.0216
dipole: 5.1202
quadrupole: -77.8205 -102.7976 -93.3924
quadrupole: -1.7914 0.5590 4.9196
quadrupole: 13.5164 -11.4608 -2.0555 -1.7914 0.5590 4.9196
hfenergy: -1105.6146148 hartree
pointgroup: C01 [X(C10H9Cl1N2O2)]
dipole: 2.0144068 -0.002781 -0.0109971 debye
dipolederiv: -0.9623379 -0.0352028 -0.037478 -0.0526556 -0.118693 0.0189725 -0.0450574 0.0161554 -0.0805112 -0.5205855 -0.1218159 -0.0073603 0.2772146 -1.079323 -0.0302046 0.0411821 -0.0466978 -0.3225021 -0.7277106 0.1694135 0.0351987 0.1874619 -1.1537158 -0.0958095 -0.0415102 -0.0467574 -0.3383743 -1.362113 0.1050916 -0.0143925 -0.0591843 -1.3099391 -0.0604733 -0.0392862 -0.0465234 -0.1106946 -1.2686688 0.1781149 0.0460072 0.1918204 -0.488125 -0.0453597 0.0618394 -0.050064 -0.5309386 -0.1749106 -0.160505 -0.003461 -0.3182959 0.4180727 0.0154262 -0.0561933 0.0100281 0.3486788 1.0380333 -0.3008572 -0.0382236 -0.6384957 1.5092369 0.0591247 0.0967603 0.0667424 0.1581072 1.7515754 -0.005438 0.0080452 0.2260896 1.8005702 0.1649142 -0.0097219 0.077913 0.2724454 1.0642449 0.0535459 0.0376742 0.0718811 -0.0362271 -0.0456284 0.0440438 -0.0112067 0.0798051 0.0732116 0.0477987 0.0484907 -0.0059073 -0.0299945 -0.0197604 -0.0327441 -0.0465463 -0.0029846 -0.0842911 -0.0483363 0.0129744 -0.0408323 -0.0368085 -0.0489405 -0.034604 -0.0242652 -0.1187828 -0.1083716 0.0499727 0.0024199 0.0426492 -0.0003491 -0.0430673 0.0299955 -0.0077299 -0.1154887 -0.3262382 0.0700052 -0.03224 0.0716463 0.0105557 -0.0515687 -0.0681329 -0.0331808 -0.0935144 -0.3044381 -0.0934434 0.0216957 -0.1076359 -0.0008723 -0.0564977 0.0491363 -0.0464422 -0.0858572 1.3153377 0.0634564 0.0637601 0.0692204 0.0977567 -0.0568637 0.0746802 -0.0644631 -0.0354679 0.0326803 0.0320003 -0.045203 0.0444227 -0.0019137 0.0277073 -0.0528285 0.0531287 -0.0664778 0.2111206 0.0167693 -0.0042495 0.048598 0.1565862 -0.0070313 0.0041301 0.0121073 0.3769413 -0.157782 -0.0560377 0.0043793 -0.0908161 0.08102 -0.0163685 -0.0057727 -0.0308211 0.0660713 0.1123011 -0.0148384 0.0089818 0.0509284 -0.0823941 -0.0156968 0.0248159 0.0075165 0.0944232 0.0616321 0.0428348 -0.0802057 0.0272643 0.0689019 0.0799702 -0.0298455 0.0436247 -0.0633502 0.1070999 0.0548746 -0.0354594 0.0322718 0.0732766 0.0513398 -0.0344632 0.0282997 0.1445751 0.1395834 -0.0474651 0.0232308 -0.0242514 0.0704361 0.0526554 0.0389572 0.0257831 0.1502363 0.0488891 -0.0546285 0.0194227 -0.0589085 0.0197009 0.0607755 0.0217612 0.0555813 0.1396942 0.0417379 0.0546903 -0.0340077 0.0555141 0.0322414 0.0623848 -0.0371421 0.0578176 0.1339668 unknown
polarizability: 211.7229797|-5.1277427|129.7295659|2.3144682|-11.1194804|69.5549046 unknown
InChI: InChI=1S/C10H9ClN2O2/c1-6-9(14)13(10(15)12-6)8-4-2-7(11)3-5-8/h2-6,12H,1H3
charge 0 multiplicity 1
24 atoms
Cl -5.194269 -0.229986 -0.169455
O  1.450824 -2.196635 0.041891
O  1.120734 2.531509 0.258085
N  0.86023 0.124327 0.128086
N  2.940515 1.023107 0.248557
C  3.18199 -0.422738 0.194879
C  1.745501 -0.979475 0.115372
C  1.603866 1.376771 0.217326
C  -0.576318 0.047335 0.06007
C  4.04376 -0.890592 -0.996611
C  -1.242547 -1.11623 0.525394
C  -1.32679 1.124463 -0.478309
C  -2.648411 -1.202245 0.451867
C  -2.733263 1.041298 -0.542849
C  -3.376147 -0.121376 -0.079232
H  3.634674 -0.784906 1.13983
H  3.665161 1.735195 0.311229
H  5.084729 -0.53831 -0.888991
H  4.047182 -1.993313 -1.030601
H  3.636364 -0.508679 -1.948298
H  -0.671966 -1.957467 0.921935
H  -0.82327 2.030224 -0.819684
H  -3.163462 -2.099211 0.806747
H  -3.314288 1.872432 -0.951937
