program: Gaussian 09
title: 000005479
version: EM64L-G09RevD.01
frameworkgroup: C1[X(C8H13N3O4S)]
method: RPBEPBE
basis: SDD
operation: Freq
keyword: #p
keyword: freq=noraman
keyword: PBEPBE/SDD
title: #p freq=noraman PBEPBE/SDD
converged: YES YES NO NO
title: Mulliken charges:
elementType: S O O O O N N N C C C C C C C C H H H H H H H H H H H H H
charge: 0.910563 -0.576891 -0.565219 -0.205151 -0.249449 -0.197636 -0.085216 0.041330 -0.538951 -0.406829 -0.496887 0.262077 0.331036 -0.634232 -0.349586 -0.749878 0.306626 0.266001 0.287069 0.287265 0.258575 0.267322 0.235590 0.253555 0.264738 0.290593 0.294599 0.234223 0.264761
chargesum: 0.00000
title: Mulliken charges with hydrogens summed into heavy atoms:
elementType: S O O O O N N N C C C C C C C C
charge: 0.910563 -0.576891 -0.565219 -0.205151 -0.249449 -0.197636 -0.085216 0.041330 0.033676 0.167506 0.029010 0.262077 0.331036 0.119652 -0.058992 0.043706
polarizability: 1.87970514e+02 -5.94374148e+00 1.63452185e+02 -1.32920314e+01 -4.47416377e+00 1.09586308e+02
1716.lowfreq: -9.0348 -4.7644 -0.0018 -0.0016 0.0008 6.7091 21.2118 34.1629 42.5634
frequency: 20.5795 33.9654 42.4289 53.1638 72.2544 96.4172 105.3500 122.6693 171.1130 173.7083 190.6183 216.5159 224.7569 243.4913 264.3216 286.5151 317.5464 328.2570 367.9262 383.7783 404.6452 449.6702 518.9648 540.7799 558.7354 598.3833 636.1694 671.6629 688.6385 712.5373 753.8085 779.6990 790.5420 852.0691 870.5281 891.5856 924.5968 961.7190 975.5374 1007.4532 1020.6004 1044.7253 1052.0287 1068.0744 1122.5643 1132.8285 1174.2591 1216.6209 1227.3375 1239.9486 1243.6069 1261.7816 1314.8031 1325.7167 1340.4529 1359.9096 1394.8156 1397.5887 1403.2788 1409.0988 1414.5254 1442.7458 1460.7251 1463.9422 1475.1461 1479.5095 1481.3483 1488.2379 2983.9406 2996.1146 3010.0242 3039.3948 3062.1737 3068.3710 3090.9488 3093.6238 3105.3305 3127.0730 3135.2686 3164.4868 3250.6292
redmass: 5.3640 5.6240 2.6256 5.1092 8.7746 4.7236 2.9034 5.4244 1.2819 1.3462 5.7733 5.4585 3.5239 3.9703 2.3286 4.2334 9.4548 2.6215 4.0427 5.2741 3.2664 4.0427 4.3124 4.6579 8.7132 4.8571 4.4243 4.7952 8.1778 4.1535 8.3968 1.3534 6.1784 2.6037 1.4427 2.8230 2.5994 1.8995 1.6023 2.1214 2.1159 1.6356 1.6617 2.5117 2.4811 1.5003 2.3304 1.7028 2.3035 1.2609 1.6664 1.3657 4.4966 11.7657 1.9128 1.3608 1.3114 1.1879 1.4292 1.8340 1.1222 1.2420 1.0350 1.9799 1.3912 1.5251 1.0527 2.9375 1.0414 1.0361 1.0660 1.0567 1.0587 1.0949 1.0980 1.0965 1.1024 1.0977 1.1094 1.1094 1.0995
irintensity: 2.1429 6.3697 1.3336 3.7343 3.1355 0.4793 0.5626 1.9177 1.0053 0.1502 17.5170 10.2614 11.4584 5.2028 3.4763 8.6188 12.4512 11.6921 13.7644 11.4405 3.2247 4.4115 6.2246 3.4717 42.3430 1.5948 0.8868 6.1266 7.5793 1.0529 11.8792 5.1876 41.3927 22.2469 17.8727 11.2822 70.9269 3.3967 19.2758 5.6878 7.9499 3.1625 22.3335 3.8958 47.3969 2.3824 190.2353 22.0200 4.7044 2.6581 89.3319 14.3419 43.7254 314.6433 12.6606 8.2712 40.0545 31.5930 10.3760 44.1851 2.0295 11.9326 19.6180 151.0308 57.5752 46.9310 17.4952 19.1716 6.0635 12.3119 7.3478 8.3224 2.7711 10.2968 5.9141 3.0914 2.9351 4.3107 6.7988 1.3066 2.5800
temp: 298.150 k
press: 1.00000 atm
elementType: 16 8 8 8 8 7 7 7 6 6 6 6 6 6 6 6 1 1 1 1 1 1 1 1 1 1 1 1 1
symmnumber: 1
zpe: 567548.5 jmol-1
zpe.correction: 0.216168 hartree
zpe.thermalcorrener: 0.233881 hartree
zpe.thermalcorrenthalpy: 0.234825 hartree
zpe.thermalcorrgfe: 0.168395 hartree
zpe.sumelectzpe: -1174.379166 hartree
zpe.sumelectthermal: -1174.361453 hartree
zpe.sumelectthermalent: -1174.360509 hartree
zpe.sumelectthermalfe: -1174.426939 hartree
dipole: -4.9771 -2.4606 1.5574
dipole: 5.7664
quadrupole: -104.8018 -110.7568 -105.2566
quadrupole: 19.3625 6.3213 2.9931
quadrupole: 2.1366 -3.8184 1.6818 19.3625 6.3213 2.9931
hfenergy: -1174.5953339 hartree
pointgroup: C01 [X(C8H13N3O4S1)]
dipole: 2.0933718 0.7945359 0.3652777 debye
polarizability: 186.3707994|-5.7450811|163.1825968|13.8624247|-11.9875966|111.4556106 unknown
InChI: InChI=1S/C8H13N3O4S/c1-3-16(14,15)5-4-10-7(2)9-6-8(10)11(12)13/h6H,3-5H2,1-2H3
charge 0 multiplicity 1
29 atoms
S  2.351359 -0.482206 -0.181429
O  2.61816 -0.962819 1.368349
O  1.917588 -1.596042 -1.305394
O  -3.60933 1.912761 -1.31998
O  -1.563468 2.429571 -0.420311
N  -1.214526 -0.345516 0.27538
N  -2.576954 -2.068933 -0.332474
N  -2.506413 1.57449 -0.733369
C  0.956531 0.886762 -0.069403
C  -0.113321 0.401158 0.914965
C  3.945978 0.43553 -0.825751
C  -1.416413 -1.726531 0.307658
C  -2.314412 0.195348 -0.433312
C  4.983226 -0.61923 -1.195158
C  -3.132612 -0.890367 -0.789291
C  -0.477549 -2.714175 0.916727
H  0.605198 1.037168 -1.098815
H  1.482126 1.775964 0.312375
H  0.35882 -0.244813 1.679799
H  -0.534801 1.281477 1.423407
H  3.587929 1.026963 -1.684913
H  4.229021 1.080922 0.021146
H  5.874468 -0.119282 -1.616639
H  5.298139 -1.200376 -0.312092
H  4.584736 -1.314715 -1.953552
H  -4.065096 -0.857085 -1.34625
H  0.438899 -2.810099 0.303719
H  -0.163825 -2.441648 1.939721
H  -0.985457 -3.689577 0.945888
