program: Gaussian 09
title: 000005478
version: EM64L-G09RevD.01
frameworkgroup: C1[X(C13H24N4O3S)]
method: RPBEPBE
basis: SDD
operation: Freq
keyword: #p
keyword: freq=noraman
keyword: PBEPBE/SDD
title: #p freq=noraman PBEPBE/SDD
converged: YES YES NO NO
title: Mulliken charges:
elementType: S O O O N N N N C C C C C C C C C C C C C H H H H H H H H H H H H H H H H H H H H H H H H
charge: 0.478101 -0.245777 -0.286662 -0.442265 -0.353877 -0.138157 -0.469137 -0.431037 0.266290 -0.412808 -0.111831 -0.381272 -0.346620 -0.691584 -0.683608 -0.724607 -0.304972 -0.312043 -0.268444 0.172400 0.201620 0.245518 0.233118 0.230039 0.186525 0.285269 0.211779 0.260995 0.226757 0.206154 0.212171 0.223975 0.206628 0.232224 0.208288 0.234404 0.211702 0.201289 0.196784 0.221436 0.221334 0.194274 0.266603 0.226496 0.342529
chargesum: 0.00000
title: Mulliken charges with hydrogens summed into heavy atoms:
elementType: S O O O N N N N C C C C C C C C C C C C C
charge: 0.478101 -0.245777 -0.286662 -0.099736 -0.108359 -0.138157 -0.469137 -0.431037 0.266290 0.050350 0.074695 0.115777 0.141131 -0.049284 -0.036467 -0.077212 0.113249 0.103564 0.224655 0.172400 0.201620
polarizability: 2.07679694e+02 9.89640208e-01 2.19362099e+02 -1.43463473e+01 -5.21267773e+00 1.62794679e+02
1716.lowfreq: -3.3170 -0.0011 -0.0005 0.0010 5.7046 8.9562 12.6652 15.0425 23.8393
frequency: 11.8517 14.0973 23.3286 35.5841 54.1293 59.9431 74.9709 103.1751 132.2367 151.3679 167.1697 172.4922 188.1057 224.8171 234.9919 241.9648 249.4779 255.0170 259.7452 264.3734 286.9857 300.8580 308.6553 320.5008 337.3594 370.6307 385.1824 393.5891 436.5551 458.5407 471.7549 478.8781 484.3322 494.0240 520.7893 530.2219 610.5482 636.1874 655.1138 678.9327 696.8680 714.0081 738.2137 790.4678 805.5025 833.3226 836.8333 876.7267 889.5519 903.1214 906.3115 921.6079 925.9353 943.7106 948.4716 1008.9142 1019.5311 1020.9322 1026.9918 1042.1260 1054.7099 1073.6507 1079.8501 1089.7406 1104.9617 1113.1739 1169.3917 1172.7419 1195.3416 1198.7890 1208.6754 1212.4170 1237.5542 1252.3702 1260.1565 1269.8641 1273.2607 1291.0737 1313.2192 1315.1406 1336.1687 1346.2304 1350.2239 1361.5621 1365.7664 1371.7347 1373.2482 1375.3293 1392.0038 1398.0569 1444.8874 1445.9548 1447.4115 1452.1828 1454.5140 1458.0660 1461.7226 1464.3865 1465.4499 1474.2017 1475.5758 1486.1349 1487.7485 1495.2076 1516.0634 2929.0488 2936.0094 2944.4977 2949.4992 2959.4385 2962.8310 2968.2541 2973.2440 2982.3065 2996.0131 3062.9299 3066.7620 3069.9986 3074.1268 3074.6608 3076.4954 3081.6109 3085.0040 3087.8205 3089.0606 3094.6318 3102.0795 3425.6936 3567.4473
redmass: 4.2788 4.4664 3.4997 3.3302 5.3133 4.8239 3.9841 3.5179 4.3486 5.1972 2.4030 1.5300 4.2184 1.7960 1.9833 1.2180 1.4763 1.4748 2.7948 1.5825 6.2890 3.4161 4.6256 4.8608 2.3698 2.3760 1.9296 2.2818 2.2276 2.8288 2.6182 5.9755 8.7215 3.5242 4.6278 5.5726 2.9548 2.8161 1.9601 6.5588 7.2349 11.8406 3.3170 5.2107 4.1697 3.5224 1.6796 2.2535 2.4765 1.9927 2.6229 1.7403 2.3726 1.2280 3.6747 1.6401 1.4147 2.3164 1.8073 2.5141 1.9887 1.7356 4.2154 2.5354 2.1995 2.9743 3.4601 1.3874 1.2205 1.1470 2.1040 2.4818 2.6200 1.4459 1.2374 2.0736 1.4350 1.7092 1.5165 1.8639 1.2703 1.3288 1.4066 1.6742 1.5351 1.2290 1.2800 1.2489 1.6257 1.2289 1.3618 1.1962 1.2097 1.1000 1.0760 1.0918 1.0499 1.1563 1.0585 1.7890 1.0804 1.1017 1.0865 1.0673 6.2388 1.0821 1.0703 1.0704 1.0697 1.0669 1.0663 1.0354 1.0368 1.0361 1.0610 1.0986 1.0993 1.0984 1.1008 1.1001 1.0930 1.0902 1.0962 1.1005 1.0977 1.0997 1.0921 1.0740 1.0662
irintensity: 0.0862 0.1420 0.1567 0.2808 0.8097 0.7730 0.0678 3.3439 2.3309 0.2798 14.3726 4.5134 4.9847 7.7826 25.7515 1.8669 2.6314 99.9415 30.9083 43.5386 6.1617 9.5192 0.6666 1.5579 0.2060 4.3591 1.8568 3.4366 5.0763 0.6437 3.1133 2.4148 17.6581 7.0523 15.9539 6.2633 16.8575 21.7932 79.7332 18.5198 9.2364 4.0098 0.7039 5.8354 11.9852 7.6747 0.8639 28.4919 24.1034 9.4410 13.2142 1.9143 31.6071 1.3285 41.3303 1.6410 1.1619 16.6839 50.8179 9.3480 20.6008 40.8931 40.7179 9.2219 2.8051 27.4386 13.3104 10.0781 53.1900 53.7942 79.6519 89.3026 31.1756 43.6939 2.1771 32.1574 18.8341 57.0424 22.9488 9.0706 2.1344 17.2804 2.9250 1.0986 1.4088 36.4841 2.0917 22.2912 21.6808 16.2905 75.7237 74.8686 16.9967 27.0374 2.2270 7.0310 0.3796 31.1797 0.7144 53.0011 12.3632 7.3003 9.5465 14.6477 232.5156 61.5744 52.8931 51.6491 36.6419 9.5437 134.5881 32.1015 45.7537 10.3578 37.7082 2.2769 10.1998 43.2580 66.6865 21.6964 9.6210 34.2513 34.3635 3.3039 31.9293 64.7241 9.7224 1.6743 4.8378
temp: 298.150 k
press: 1.00000 atm
elementType: 16 8 8 8 7 7 7 7 6 6 6 6 6 6 6 6 6 6 6 6 6 1 1 1 1 1 1 1 1 1 1 1 1 1 1 1 1 1 1 1 1 1 1 1 1
symmnumber: 1
zpe: 975393.2 jmol-1
zpe.correction: 0.371508 hartree
zpe.thermalcorrener: 0.394812 hartree
zpe.thermalcorrenthalpy: 0.395756 hartree
zpe.thermalcorrgfe: 0.315979 hartree
zpe.sumelectzpe: -1350.765439 hartree
zpe.sumelectthermal: -1350.742134 hartree
zpe.sumelectthermalent: -1350.741190 hartree
zpe.sumelectthermalfe: -1350.820967 hartree
dipole: -2.8314 -0.7177 1.3014
dipole: 3.1977
quadrupole: -125.0668 -151.6274 -127.0911
quadrupole: 0.3763 2.0347 3.3558
quadrupole: 9.5283 -17.0323 7.5040 0.3763 2.0347 3.3558
hfenergy: -1351.1369465 hartree
pointgroup: C01 [X(C13H24N4O3S1)]
dipole: -1.118216 -0.1071698 -0.5664349 debye
polarizability: 206.8705194|5.5719874|204.7900656|15.626425|-24.3837814|178.175888 unknown
InChI: InChI=1S/C13H24N4O3S/c1-13(2,3)14-8-10(18)9-20-12-11(15-21-16-12)17-4-6-19-7-5-17/h10,14,18H,4-9H2,1-3H3
charge 0 multiplicity 1
45 atoms
S  2.148814 -2.760351 1.885012
O  3.212722 3.297432 -0.879746
O  -0.021681 -0.874366 -0.716032
O  -1.474146 -0.401992 -3.153521
N  -3.62292 -0.42034 -0.119161
N  2.365881 0.732154 0.142519
N  2.818813 -1.109149 1.580593
N  0.765617 -2.56722 0.750507
C  -3.847075 0.424668 1.100904
C  -2.797963 0.122331 -1.218578
C  -2.101516 -1.026965 -1.978539
C  1.372108 1.687173 -0.412123
C  3.588911 1.385066 0.67201
C  -4.451089 1.818518 0.754217
C  -2.507737 0.60286 1.859738
C  -4.835933 -0.36279 1.995114
C  2.053736 2.592374 -1.451864
C  4.192481 2.309401 -0.398124
C  -1.117486 -1.804658 -1.102895
C  2.029494 -0.515329 0.652029
C  0.877446 -1.349207 0.215532
H  -4.520777 -0.785202 -0.467722
H  -3.364028 0.720899 -1.964893
H  -2.014921 0.778367 -0.804213
H  -2.87202 -1.765298 -2.300971
H  0.546744 1.135126 -0.884653
H  0.964275 2.317966 0.40858
H  4.307214 0.601417 0.964871
H  3.339871 1.969702 1.583476
H  -5.430384 1.707023 0.25099
H  -4.601469 2.424433 1.667237
H  -3.781931 2.38537 0.080962
H  -1.77648 1.193315 1.277491
H  -2.059694 -0.382299 2.078709
H  -2.678518 1.134815 2.813133
H  -4.418068 -1.352706 2.249984
H  -5.038867 0.187013 2.93112
H  -5.803731 -0.516471 1.478106
H  2.378087 1.983666 -2.323378
H  1.362672 3.381628 -1.789824
H  5.025315 2.896488 0.022339
H  4.561007 1.702175 -1.25333
H  -1.636134 -2.158421 -0.194351
H  -0.664641 -2.668585 -1.627752
H  -0.8874 -1.059531 -3.605605
