program: Gaussian 09
title: 000041593
version: EM64L-G09RevD.01
frameworkgroup: C1[X(C17H26N2O3)]
method: RPBEPBE
basis: SDD
operation: Freq
keyword: #p
keyword: freq=noraman
keyword: PBEPBE/SDD
title: #p freq=noraman PBEPBE/SDD
converged: YES YES NO NO
title: Mulliken charges:
elementType: O O O N N C C C C C C C C C C C C C C C C C H H H H H H H H H H H H H H H H H H H H H H H H H H
charge: -0.317998 -0.268691 -0.275672 -0.081403 -0.460751 -0.363355 -0.370786 -0.392033 -0.385842 -0.398868 -0.356231 -0.264299 0.257942 0.480091 0.341713 -0.433067 -0.363963 -0.254544 -0.393867 -0.359481 -0.338246 -0.678718 0.174388 0.208747 0.212805 0.167864 0.207638 0.192619 0.192335 0.205408 0.215162 0.188878 0.198290 0.217544 0.238715 0.229763 0.326045 0.200408 0.200912 0.223394 0.297574 0.217895 0.217911 0.250054 0.246563 0.226643 0.210187 0.210328
chargesum: 0.00000
title: Mulliken charges with hydrogens summed into heavy atoms:
elementType: O O O N N C C C C C C C C C C C C C C C C C
charge: -0.317998 -0.268691 -0.275672 -0.081403 -0.134707 0.019780 0.009882 0.008224 0.011901 0.005172 0.059603 0.204179 0.257942 0.480091 0.341713 -0.209672 -0.066389 0.146775 0.041939 -0.109426 -0.091683 -0.031560
polarizability: 3.40970943e+02 -2.81324430e+00 1.90331828e+02 3.95688413e+00 6.65752620e+00 1.37023136e+02
1716.lowfreq: -17.8946 -8.1137 -3.2942 -0.0017 0.0015 0.0022 1.3401 16.0067 22.9901
frequency: -14.5990 15.9455 22.8966 31.0164 54.5945 55.6249 64.6380 83.2080 88.6276 106.4605 128.7487 143.3406 146.8145 172.0139 191.3842 225.0714 226.7951 248.3975 270.3443 278.5498 314.1576 351.5552 362.2604 369.7035 381.7907 412.4519 414.2642 448.9185 464.6236 480.5300 522.3375 557.2299 584.2423 628.9422 629.5243 694.4505 699.0232 718.2299 756.1895 768.0516 779.1398 793.5200 805.0351 814.5822 833.1406 836.8882 851.2985 854.6634 896.3495 901.7648 903.8581 916.7416 940.1396 957.5662 966.5769 983.0563 994.0584 997.5003 1014.4554 1045.8976 1050.6283 1055.0597 1088.8065 1101.0805 1115.7625 1122.5927 1125.9344 1136.0659 1142.9530 1150.4705 1158.7866 1161.8006 1178.6143 1183.8409 1218.7436 1230.3998 1244.7163 1259.0104 1260.0289 1265.9299 1284.9531 1285.8185 1293.2817 1309.8832 1310.8518 1317.4045 1330.5984 1340.1937 1346.5871 1353.2941 1370.2831 1374.0014 1383.6620 1393.6121 1397.2837 1423.5352 1450.3616 1459.5256 1460.7631 1465.2890 1471.5966 1472.6719 1479.2600 1480.0904 1480.2753 1484.5407 1489.4571 1500.5958 1515.9432 1595.1641 1633.1684 1661.8328 2818.9779 2828.7290 2891.0404 2942.1310 2966.1197 2977.7947 2986.1038 2986.4328 2999.1569 3003.0525 3018.2756 3024.4762 3031.1030 3036.5060 3037.9301 3046.7430 3051.2479 3055.6074 3079.8137 3082.9130 3090.6577 3119.1794 3158.8864 3167.6362 3187.5830 3545.7109
redmass: 3.1003 4.4683 4.3046 4.3032 3.4609 3.4314 5.0037 2.6176 2.9252 3.2399 2.7246 3.0695 4.8175 3.7513 4.8833 1.1967 2.0174 2.6864 5.6207 3.4595 2.3229 4.3670 3.7188 5.8621 2.1463 3.1263 3.1040 2.9069 3.2403 3.8494 2.4015 1.9933 5.9272 6.4419 1.2718 6.7767 7.1123 3.7184 3.7575 1.0818 4.4242 1.3272 1.3905 1.2966 1.5973 5.6236 1.5041 2.5760 1.1529 1.7153 2.3828 6.4657 1.3596 1.3050 1.3144 7.0969 2.9389 3.0249 4.3320 1.9603 1.9291 2.7686 2.8658 1.5972 2.0435 1.3286 2.0897 2.1382 1.4520 1.3081 2.7249 2.6109 1.1923 1.3025 2.5063 1.2607 1.6521 1.2974 2.1568 1.1822 1.2246 1.1033 1.3908 1.3560 1.4285 1.3537 1.3099 1.4136 1.4988 1.4299 1.8661 1.9196 1.7139 1.2569 1.5177 3.8642 1.0908 1.0873 1.0832 1.0896 1.0821 1.0772 1.0991 1.0449 1.0938 1.0963 1.1532 1.8649 2.5350 5.5108 6.4888 8.8128 1.0714 1.0700 1.0695 1.0550 1.0627 1.0361 1.0625 1.0600 1.1063 1.0601 1.0588 1.0878 1.0906 1.0916 1.0892 1.1033 1.1015 1.1036 1.1028 1.0988 1.1086 1.0899 1.0891 1.0947 1.0951 1.0760
irintensity: 0.1929 0.0926 0.1985 1.5464 0.7380 0.5595 2.9322 0.8075 0.6169 0.0737 0.5730 8.8865 0.5529 1.9431 0.3493 0.2040 3.6624 2.9277 4.7542 2.4357 7.6251 0.3832 13.2472 3.2800 2.6912 16.5451 0.0179 0.3541 3.6931 3.9232 29.1813 3.6249 6.8684 8.1235 49.2173 37.4450 32.3183 0.5109 8.8272 11.2499 18.7141 1.8199 0.1261 16.7332 85.4462 1.1966 3.5190 10.5344 4.0593 5.6868 2.4847 8.4453 0.4802 2.6571 2.9643 190.8434 4.5543 113.1321 198.1558 47.4054 20.1970 6.0414 27.2463 33.5713 25.7273 21.8293 4.9542 9.5715 0.2360 8.7316 556.7945 139.0063 4.5415 5.0714 248.2716 0.2859 7.4390 7.1517 20.1819 4.1708 11.6537 0.0259 9.5627 7.2252 14.0378 8.1165 0.7222 0.3301 0.8740 1.6468 18.2486 48.9116 9.8746 18.0785 2.6661 59.2577 7.3189 12.4838 5.0267 10.5036 15.4590 19.6136 17.9319 13.3628 10.6251 23.8889 51.4163 18.2701 822.3648 19.0925 2.6085 247.4779 48.6116 152.4617 92.8142 34.9808 40.1568 38.9380 27.3431 39.1314 30.1809 24.7852 28.9605 48.5102 65.7302 37.4630 21.2134 18.1464 0.2452 98.3151 83.9040 46.0332 35.7629 20.5978 12.9033 6.4069 5.7323 28.8542
temp: 298.150 k
press: 1.00000 atm
elementType: 8 8 8 7 7 6 6 6 6 6 6 6 6 6 6 6 6 6 6 6 6 6 1 1 1 1 1 1 1 1 1 1 1 1 1 1 1 1 1 1 1 1 1 1 1 1 1 1
symmnumber: 1
zpe: 1071854.0 jmol-1
zpe.correction: 0.408248 hartree
zpe.thermalcorrener: 0.430288 hartree
zpe.thermalcorrenthalpy: 0.431232 hartree
zpe.thermalcorrgfe: 0.354194 hartree
zpe.sumelectzpe: -996.877930 hartree
zpe.sumelectthermal: -996.855890 hartree
zpe.sumelectthermalent: -996.854945 hartree
zpe.sumelectthermalfe: -996.931984 hartree
dipole: -0.6227 1.0867 0.6059
dipole: 1.3913
quadrupole: -103.2133 -127.5574 -134.8433
quadrupole: -11.0891 -3.6184 -0.1501
quadrupole: 18.6580 -5.6860 -12.9720 -11.0891 -3.6184 -0.1501
hfenergy: -997.2861779 hartree
pointgroup: C01 [X(C17H26N2O3)]
dipole: 0.2346274 0.4605146 -0.1803038 debye
polarizability: 340.9578879|4.5253534|191.2335584|0.4183244|1.015456|136.1344613 unknown
InChI: InChI=1S/C17H26N2O3/c1-2-13-21-16-8-6-15(7-9-16)18-17(20)22-14-12-19-10-4-3-5-11-19/h6-9,18H,2-5,10-14H2,1H3
charge 0 multiplicity 1
48 atoms
O  1.77163 0.750372 0.211443
O  -6.103981 0.415529 0.138897
O  0.431559 -1.188602 0.302751
N  5.445592 0.050511 0.18467
N  -0.471519 1.001421 0.158587
C  5.789423 -0.514288 -1.146369
C  6.588809 0.796542 0.769721
C  6.995706 -1.470059 -1.051009
C  7.818601 -0.120368 0.929834
C  8.212881 -0.752409 -0.42484
C  4.185174 0.828983 0.168767
C  2.980106 -0.111193 0.302829
C  0.540293 0.061694 0.231004
C  -1.877251 0.769528 0.155481
C  -4.699764 0.457894 0.148471
C  -2.730596 1.903532 0.065429
C  -2.450565 -0.522799 0.24012
C  -6.750228 -0.906382 0.223093
C  -8.262167 -0.67029 0.193126
C  -4.126251 1.751005 0.062105
C  -3.85476 -0.675282 0.236199
C  -9.049147 -1.997509 0.257218
H  6.027719 0.306977 -1.874961
H  4.911908 -1.056495 -1.543561
H  6.279135 1.18951 1.75604
H  6.871191 1.676918 0.131837
H  6.713671 -2.338673 -0.425275
H  7.243095 -1.849887 -2.061056
H  8.660427 0.463895 1.349021
H  7.570328 -0.920973 1.653189
H  9.05413 -1.458752 -0.292796
H  8.564282 0.044275 -1.113528
H  4.071917 1.446782 -0.75501
H  4.18295 1.526356 1.026302
H  2.989006 -0.632868 1.275221
H  2.941178 -0.869082 -0.499434
H  -0.155411 1.971879 0.105295
H  -6.429948 -1.534683 -0.63514
H  -6.445624 -1.412323 1.16386
H  -2.299996 2.910598 -0.002182
H  -1.79909 -1.396548 0.30819
H  -8.516821 -0.117902 -0.730599
H  -8.538332 -0.018884 1.043093
H  -4.789505 2.618322 -0.006603
H  -4.270019 -1.685024 0.302926
H  -10.136853 -1.808286 0.236078
H  -8.823834 -2.556731 1.184895
H  -8.805351 -2.652532 -0.600329
