program: Gaussian 09
title: 000005437
version: EM64L-G09RevD.01
frameworkgroup: C1[X(C3H3NO2S)]
method: RPBEPBE
basis: SDD
operation: Freq
keyword: #p
keyword: freq=noraman
keyword: PBEPBE/SDD
title: #p freq=noraman PBEPBE/SDD
converged: NO NO NO NO
title: Mulliken charges:
elementType: S O O N C C C H H H
charge: 0.245018 -0.195199 -0.145460 -0.348570 -0.750610 0.272434 -0.066807 0.309041 0.309042 0.371110
chargesum: 0.00000
title: Mulliken charges with hydrogens summed into heavy atoms:
elementType: S O O N C C C
charge: 0.245018 -0.195199 -0.145460 0.022541 -0.132528 0.272434 -0.066807
polarizability: 8.05799823e+01 4.28201966e+00 6.62412525e+01 -8.55332899e-04 1.35468204e-03 2.87223650e+01
1716.lowfreq: -0.0034 -0.0027 -0.0006 12.0843 18.8231 22.2772 114.8547 165.0407 341.7328
frequency: 114.8074 165.0375 341.7323 432.9103 466.8608 536.4596 575.9935 600.6102 620.9017 734.6857 738.5766 867.3363 897.5861 1123.4031 1126.7881 1229.3827 1267.1956 1352.7964 1423.9047 1658.6643 1691.2568 3051.4705 3123.4637 3539.4040
redmass: 3.3736 7.1805 15.5183 12.9484 9.4612 2.2696 12.8331 6.1006 6.7431 5.6700 1.3688 3.8544 1.6728 5.0349 1.1544 1.6854 3.1942 1.5891 1.0834 7.5391 12.6901 1.0573 1.1066 1.0782
irintensity: 9.2780 6.2766 8.4830 14.0039 19.1066 6.3751 0.5935 2.0571 43.2140 13.1929 139.7538 2.6154 10.2609 173.1953 0.0540 79.2592 88.2136 6.5364 15.1206 616.7134 177.3798 4.2941 0.0801 66.1053
temp: 298.150 k
press: 1.00000 atm
elementType: 16 8 8 7 6 6 6 1 1 1
symmnumber: 1
zpe: 165570.5 jmol-1
zpe.correction: 0.063062 hartree
zpe.thermalcorrener: 0.069205 hartree
zpe.thermalcorrenthalpy: 0.070150 hartree
zpe.thermalcorrgfe: 0.032344 hartree
zpe.sumelectzpe: -718.883685 hartree
zpe.sumelectthermal: -718.877542 hartree
zpe.sumelectthermalent: -718.876598 hartree
zpe.sumelectthermalfe: -718.914403 hartree
dipole: 1.1564 1.1666 -0.0005
dipole: 1.6426
quadrupole: -62.9936 -42.8285 -46.5307
quadrupole: 0.7342 0.0013 0.0014
quadrupole: -12.2093 7.9557 4.2536 0.7342 0.0013 0.0014
hfenergy: -718.9467475 hartree
pointgroup: C01 [X(C3H3N1O2S1)]
dipole: 0.5155413 0.3896994 -0.0003675 debye
dipolederiv: -0.1017225 -0.1740787 0.0000435 -0.2199308 -0.575736 0.0001751 0.0000161 0.0000436 -0.0403388 -1.0835588 0.2022854 0.0000056 0.380494 -0.5750339 0.0000453 -0.0000846 0.0000326 -0.3411851 -1.1159498 -0.4203877 0.0000406 -0.3883093 -0.7309659 0.0001062 0.0006768 0.0005395 -0.2910857 -1.5575204 0.1964565 0.0001541 -0.0966987 -0.61306 0.0000071 -0.0000495 0.0001731 -0.3157893 0.2807616 -0.0014019 -0.000028 0.0959079 -0.4199749 0.0000969 -0.0000211 0.0000167 0.0993512 1.6452762 -0.099037 -0.0000708 0.0354305 0.8478023 -0.0001438 -0.0000892 -0.000079 0.2350015 1.7744269 0.3087442 -0.0001677 0.1330269 1.6187752 -0.0003231 -0.0004761 -0.0008143 0.1943191 0.0035402 -0.0172105 -0.0526093 0.0255183 0.1113931 -0.028933 -0.0515765 -0.0470862 0.0418345 0.0035205 -0.0171674 0.0526442 0.0255149 0.1114039 0.028908 0.0515879 0.0470897 0.041796 0.1512262 0.0217972 -0.000012 0.0090462 0.2253962 0.0000614 0.0000162 0.0000844 0.3760965 unknown
polarizability: 81.4947564|2.0933613|65.3264754|-0.0072944|-0.0090429|28.722368 unknown
InChI: InChI=1S/C3H3NO2S/c5-2-1-7-3(6)4-2/h4H,1H2
charge 0 multiplicity 1
10 atoms
S  -0.928738 1.581308 -0.000396
O  2.340192 -0.73237 -0.000046
O  -2.362806 -0.792862 0.000719
N  -0.003685 -0.928673 0.000073
C  0.939238 1.30128 -0.000461
C  1.20252 -0.208451 -0.000123
C  -1.244112 -0.251702 -0.000261
H  1.385661 1.755256 0.898008
H  1.385592 1.754948 -0.89912
H  0.000838 -1.952833 0.000507
