program: Gaussian 09
title: 000005430
version: EM64L-G09RevD.01
frameworkgroup: C1[X(C10H7N3S)]
method: RPBEPBE
basis: SDD
operation: Freq
keyword: #p
keyword: freq=noraman
keyword: PBEPBE/SDD
title: #p freq=noraman PBEPBE/SDD
converged: NO YES NO NO
title: Mulliken charges:
elementType: S N N N C C C C C C C C C C H H H H H H H
charge: 0.291717 -0.445905 -0.057714 -0.044586 0.287062 0.017241 0.109375 0.303428 -0.361407 -0.342843 -0.212337 -0.231906 -0.676758 -0.487458 0.336130 0.236155 0.249836 0.224445 0.226025 0.304051 0.275449
chargesum: 0.00000
title: Mulliken charges with hydrogens summed into heavy atoms:
elementType: S N N N C C C C C C C C C C
charge: 0.291717 -0.109775 -0.057714 -0.044586 0.287062 0.017241 0.109375 0.303428 -0.125252 -0.093007 0.012108 -0.005881 -0.372708 -0.212009
polarizability: 2.69636654e+02 -2.74550145e+00 1.37758712e+02 -3.31164266e-03 4.62735161e-05 5.41883784e+01
1716.lowfreq: -4.1873 -0.0026 -0.0011 0.0006 4.0994 10.4418 61.9434 74.1757 88.8458
frequency: 61.9407 74.1695 88.8417 190.1569 255.9139 280.5977 325.8918 333.9711 432.9449 471.6169 520.9251 556.9945 578.0882 591.5635 615.1507 647.3493 688.4115 709.1306 722.7549 746.6729 756.6780 770.8830 787.8123 812.7054 816.4091 858.2134 860.5959 880.8677 937.9069 942.0214 977.0305 1005.2167 1067.8120 1111.8269 1158.8217 1165.7808 1215.5933 1220.3972 1260.2519 1277.5302 1298.6320 1344.2016 1408.5265 1429.6334 1444.9159 1467.9154 1479.3184 1576.8633 1605.4574 1633.8521 3131.0458 3144.0050 3158.8739 3171.8813 3229.1281 3258.4926 3583.3214
redmass: 8.8031 4.5362 6.6439 6.7614 4.8833 9.7101 5.7916 6.1459 3.0983 4.3716 5.7328 9.1525 3.6734 9.5070 6.5644 7.2349 1.1313 7.1612 2.5012 1.4401 1.4453 3.5479 5.1587 1.4752 4.9051 1.5081 7.0246 5.7370 1.3803 5.5896 1.3064 2.0845 1.8993 1.5868 1.1615 1.4305 2.5036 1.4269 2.5600 2.2802 3.3687 3.2016 2.7758 5.3086 5.4355 7.8667 3.2068 6.5539 8.8213 7.6394 1.0854 1.0903 1.0960 1.0993 1.0962 1.0967 1.0815
irintensity: 3.5718 0.8680 2.5604 0.1115 5.1151 0.7950 1.3716 0.1945 5.9576 8.8993 13.9654 4.2295 0.6344 5.9224 2.4586 2.0899 78.9619 4.6573 2.3880 2.0949 148.1269 10.3583 3.9774 66.9368 43.5102 0.0818 14.3920 0.5709 4.7665 2.0330 0.0401 7.0562 3.8614 3.3953 1.0867 5.4304 3.1680 23.1637 6.3839 41.0764 22.4738 85.6994 4.9347 21.4522 13.9771 46.6290 2.7941 7.2616 1.7493 2.4398 0.5955 10.5444 25.2693 24.8946 0.3693 11.1449 70.7430
temp: 298.150 k
press: 1.00000 atm
elementType: 16 7 7 7 6 6 6 6 6 6 6 6 6 6 1 1 1 1 1 1 1
symmnumber: 1
zpe: 395626.0 jmol-1
zpe.correction: 0.150686 hartree
zpe.thermalcorrener: 0.161078 hartree
zpe.thermalcorrenthalpy: 0.162022 hartree
zpe.thermalcorrgfe: 0.113617 hartree
zpe.sumelectzpe: -946.628856 hartree
zpe.sumelectthermal: -946.618464 hartree
zpe.sumelectthermalent: -946.617520 hartree
zpe.sumelectthermalfe: -946.665926 hartree
dipole: 1.2438 2.1806 0.0002
dipole: 2.5104
quadrupole: -72.0530 -80.2775 -93.0379
quadrupole: 0.1123 0.0000 0.0003
quadrupole: 9.7364 1.5119 -11.2484 0.1123 0.0000 0.0003
hfenergy: -946.7795424 hartree
pointgroup: C01 [X(C10H7N3S1)]
dipole: 0.5114878 0.8448902 0.0000602 debye
dipolederiv: -0.4888319 0.2042426 -0.0000132 0.0155372 -0.2277131 0.0000287 -0.0001229 0.000055 0.1612346 -0.4542221 0.0327307 -0.0000033 -0.1725297 -0.4976223 -0.000012 0.0000278 -0.0000283 -0.2531531 -0.4306763 -0.1678621 -0.000004 -0.0681576 -0.3987473 -0.0000057 0. 0.0000037 -0.2610494 -0.7118093 0.3971457 -0.0000397 0.09021 -0.3284216 0.0000037 0.0000342 -0.0000266 -0.167894 0.1411649 0.1207329 0.0000232 0.2817967 -0.0513235 -0.0000037 0.0000176 -0.0000007 0.073644 0.1504901 0.0620525 0.0000025 -0.1546636 -0.0419301 -0.0000017 -0.0000115 -0.000003 0.0164118 0.2700983 -0.0374823 -0.000019 -0.0344159 0.6524457 0.0000269 -0.0000352 0.0000275 0.1126297 0.560542 -0.0180251 -0.0000326 0.1362808 -0.0256088 0.0000111 -0.0001024 -0.0000051 0.0346861 0.1672955 -0.1051359 -0.0000113 -0.0822346 0.0716744 0.0000105 -0.0000101 0.0000125 -0.1910545 0.2218859 -0.0299466 -0.0000079 0.0702017 0.1119773 0.0000039 0.0000012 0.0000084 -0.1558084 -0.1870324 0.0004614 0.0000066 -0.2804892 0.1035045 0.0000109 -0.0000073 0.0000017 -0.1731496 -0.1221102 0.0983142 0.0000047 0.3733208 -0.0692992 -0.0000071 0.0000027 0.0000013 -0.1835762 0.2848672 -0.0551185 0.0000485 0.1885445 -0.0962529 0.0000129 0.000161 -0.0000264 -0.2675396 0.2069362 -0.4683339 0.0000487 -0.2745571 0.543492 -0.0000789 0.0000834 0.0000058 -0.1847726 0.2924857 -0.002293 -0.0000002 0.0030759 0.2254689 -0.0000012 -0.0000041 0.0000017 0.3421429 0.0749953 -0.0218044 -0.0000004 0.0312363 -0.1006622 -0.0000079 0.0000017 -0.0000088 0.181017 0.0946768 0.0160366 0.000001 -0.0353929 -0.0673059 -0.0000039 0.0000011 -0.0000072 0.1665322 -0.0946178 0.0976209 0.0000035 0.0979986 0.0315043 -0.0000027 0.0000056 -0.0000027 0.163761 -0.113172 -0.0891101 0.0000006 -0.0923963 0.0399409 -0.0000015 0. -0.0000007 0.1655309 0.0861324 -0.0362576 -0.0000062 -0.0526966 0.1012137 0.0000046 -0.0000123 0.000011 0.2223807 0.0509015 0.0020322 -0.0000013 -0.0406692 0.0236652 0.000013 -0.0000307 -0.0000192 0.1980266 unknown
polarizability: 269.4049785|-6.1674108|137.990387|-0.0033093|0.0001323|54.1883784 unknown
InChI: InChI=1S/C10H7N3S/c1-2-4-8-7(3-1)12-10(13-8)9-5-14-6-11-9/h1-6,12H
charge 0 multiplicity 1
21 atoms
S  4.594292 -0.68369 0.000078
N  -0.16309 1.034282 0.000146
N  -0.211736 -1.256662 0.000076
N  2.661011 1.145977 -0.000014
C  -1.518136 0.690519 0.000136
C  -1.530134 -0.752921 0.000106
C  0.572571 -0.157766 0.000071
C  2.02836 -0.119065 0.000026
C  -2.703351 1.454836 0.000153
C  -2.762445 -1.447551 0.000103
C  -3.919716 0.739644 0.000144
C  -3.949038 -0.687619 0.00012
C  2.884471 -1.212983 -0.000052
C  3.974662 1.032545 -0.000111
H  0.268978 1.958294 0.000168
H  -2.691333 2.549632 0.000182
H  -2.777792 -2.541525 0.00008
H  -4.86586 1.292064 0.000159
H  -4.918033 -1.198504 0.000117
H  2.613316 -2.26543 -0.000051
H  4.675402 1.866322 -0.000136
