program: Gaussian 09
title: 000005429
version: EM64L-G09RevD.01
frameworkgroup: C1[X(C7H8N4O2)]
method: RPBEPBE
basis: SDD
operation: Freq
keyword: #pfreq=noraman
keyword: PBEPBE/SDD
title: #p freq=noraman PBEPBE/SDD
converged: NO NO NO NO
title: Mulliken charges:
elementType: O O N N N N C C C C C C C H H H H H H H H
charge: -0.262315 -0.260073 -0.141639 -0.150669 -0.408119 -0.089992 0.155104 0.109066 0.147488 0.175710 -0.218904 -0.608046 -0.598157 0.269108 0.363262 0.248932 0.248941 0.269426 0.263803 0.263760 0.223313
chargesum: 0.00000
title: Mulliken charges with hydrogens summed into heavy atoms:
elementType: O O N N N N C C C C C C C
charge: -0.262315 -0.260073 -0.141639 -0.150669 -0.044857 -0.089992 0.155104 0.109066 0.147488 0.175710 0.050204 0.159253 0.152719
polarizability: 1.44024243e+02 -2.13250207e-01 1.26054772e+02 1.22384299e-03 -3.06255442e-03 5.29126483e+01
1716.lowfreq: -5.3266 -5.2553 -0.0009 -0.0008 -0.0006 8.0124 19.5436 90.1711 102.9996
frequency: 16.9526 90.1710 102.9960 116.8222 157.3484 202.0148 206.7314 244.1077 293.7635 352.4474 369.7964 389.2723 430.2476 492.0395 579.5054 598.5665 644.6094 659.0945 695.3940 696.3290 734.5314 753.6810 764.7034 805.4716 907.6693 1004.5562 1051.0445 1111.5949 1125.8142 1132.8773 1159.9952 1174.5332 1211.8910 1269.1575 1294.7726 1325.5433 1359.3756 1362.9029 1405.4382 1424.3727 1455.9941 1457.8295 1477.6284 1481.4615 1486.5094 1515.2227 1568.8171 1644.4411 1658.9859 3007.8495 3011.3699 3098.5814 3109.0255 3122.1608 3136.0233 3239.6316 3527.5154
redmass: 1.1173 3.3431 1.1485 3.0954 6.6503 3.6525 5.9297 4.6523 3.1082 8.2662 6.9596 6.3446 7.5468 6.0870 9.2557 3.6278 2.9195 5.8665 4.7469 5.5357 3.2396 6.8205 2.8455 1.4671 3.6153 3.8636 1.9494 3.7338 1.3212 1.2969 2.9770 3.1164 2.1412 5.8064 5.9828 3.8204 1.8220 4.4053 2.2006 1.2604 1.6192 1.0388 1.0421 1.2140 1.1655 2.9821 8.3569 8.6217 6.5598 1.0332 1.0329 1.1026 1.1024 1.1031 1.1018 1.0989 1.0769
irintensity: 0.6864 0.2602 0.0220 4.4266 4.3412 11.8406 7.0146 3.0024 0.9931 13.2335 0.0168 4.3276 20.9464 12.5853 3.5412 3.8182 23.2511 7.0544 7.2115 0.5943 30.8319 7.6482 89.0851 29.3318 2.2800 0.9867 14.7594 42.2307 1.0158 0.2805 40.9280 18.6515 74.1295 24.5033 27.6541 29.6134 23.6633 4.1561 60.9270 22.0872 113.9397 16.8464 18.4934 49.7904 23.6894 29.0679 64.7051 529.9929 632.9383 33.5105 26.4676 17.5184 9.7015 9.3971 0.4197 1.4815 68.6468
temp: 298.150 k
press: 1.00000 atm
elementType: 8 8 7 7 7 7 6 6 6 6 6 6 6 1 1 1 1 1 1 1 1
symmnumber: 1
zpe: 411020.0 jmol-1
zpe.correction: 0.156549 hartree
zpe.thermalcorrener: 0.168199 hartree
zpe.thermalcorrenthalpy: 0.169143 hartree
zpe.thermalcorrgfe: 0.117616 hartree
zpe.sumelectzpe: -640.094996 hartree
zpe.sumelectthermal: -640.083347 hartree
zpe.sumelectthermalent: -640.082402 hartree
zpe.sumelectthermalfe: -640.133930 hartree
dipole: 3.9112 -2.5390 0.0010
dipole: 4.6630
quadrupole: -70.2200 -82.6731 -75.1066
quadrupole: -1.5929 -0.0015 0.0017
quadrupole: 5.7799 -6.6732 0.8933 -1.5929 -0.0015 0.0017
hfenergy: -640.2515456 hartree
pointgroup: C01 [X(C7H8N4O2)]
dipole: 1.6037017 -0.8909428 0.0004011 debye
dipolederiv: -0.7567544 -0.3352293 -0.0000005 -0.3458513 -1.2006625 0.0000239 0.0001761 0.0002422 -0.3575214 -1.4903423 0.2122694 0.000131 0.1897419 -0.5396403 -0.0000058 -0.0005914 0.0001365 -0.3825994 -0.5446638 -0.3366956 -0.0000012 -0.3623875 -0.2370515 -0.0000017 0.0002089 0.0001067 -0.0870114 -1.2032882 -0.1212624 -0.0000526 0.4972919 -0.7280905 0.0001218 -0.0000103 -0.0000482 -0.1550836 -1.2706314 -0.2650958 0.0000196 -0.3428555 -0.5204406 -0.0000967 0.0000531 0.0000317 -0.3639936 -0.8206062 -0.0696006 0.000007 0.201212 -0.3412016 0.0000079 0.0000606 0.0000085 -0.2445498 0.0627065 0.1847785 -0.0000368 -0.1029551 -0.9754274 0.0000352 -0.0000862 -0.0000813 -0.0354525 1.1520149 0.1170357 -0.0000015 -0.3524298 0.2830945 -0.0000012 -0.0000598 -0.0000516 0.0847171 1.4444138 0.1722765 -0.000055 0.2071636 1.6791576 -0.0000621 -0.0001174 -0.0001746 0.2713533 1.9578354 -0.2245587 -0.0000333 -0.317652 1.1995457 -0.0000484 0.0004474 -0.0002118 0.2922699 0.4083779 0.2747485 -0.0000288 0.3864709 0.2923396 -0.0000118 -0.0000762 0.0000249 -0.0777872 0.1856115 0.2623981 -0.0000344 0.2231256 0.3820711 -0.0000443 0.0000023 -0.0000146 0.2050091 0.456092 0.1110471 0.0000319 0.1497462 0.1944883 0.0000734 -0.0000046 0.0000391 0.1944486 -0.0011613 0.0412278 0.0000129 0.0261325 0.1074853 0.000002 0.0000286 -0.0000357 0.1843232 0.1531116 -0.0418344 0.0000041 -0.0472118 0.2266861 0.0000243 0.0000009 0.0000387 0.3377434 0.1090186 0.0136433 -0.0658346 -0.051862 -0.0171562 0.0657746 -0.0161102 0.0996972 -0.0422333 0.1090331 0.0137195 0.0659093 -0.0517831 -0.0171097 -0.0657604 0.0161934 -0.0996416 -0.0421153 -0.0121403 -0.0267333 -0.0000358 0.1010715 0.1384604 0.0000279 -0.000023 0.0000126 0.1322056 0.0515567 -0.0095357 -0.0341592 -0.0814474 0.0407628 0.074884 0.0208245 0.0773093 -0.0192988 0.0514411 -0.0096197 0.0341112 -0.0814847 0.0408099 -0.0748508 -0.0209709 -0.0773299 -0.0194999 -0.0416252 0.0370209 0.0000467 0.1559641 -0.0081209 -0.0000918 0.000054 -0.0000582 0.1250762 unknown
polarizability: 143.968789|1.0192521|126.110226|0.0014312|-0.0029713|52.9126483 unknown
InChI: InChI=1S/C7H8N4O2/c1-10-3-8-5-4(10)6(12)9-7(13)11(5)2/h3,9H,1-2H3
charge 0 multiplicity 1
21 atoms
O  0.986949 2.657617 -0.000276
O  -3.279617 0.70196 -0.000324
N  2.096196 -0.304821 -0.000026
N  -1.444742 -0.777678 0.000134
N  -1.114758 1.590345 0.000011
N  0.656283 -2.086876 0.00002
C  0.796119 0.221875 0.000168
C  -0.059487 -0.89737 0.000112
C  0.312943 1.582967 0.000107
C  -2.033148 0.507224 0.00028
C  1.955375 -1.684064 0.000006
C  -2.301833 -1.978895 0.000016
C  3.349445 0.46659 0.00002
H  2.809499 -2.357373 -0.000079
H  -1.561063 2.513186 -0.000259
H  -2.098154 -2.589094 0.895663
H  -2.097681 -2.589243 -0.895417
H  -3.348571 -1.640365 -0.000258
H  3.40153 1.111816 -0.891705
H  3.401909 1.111108 0.892239
H  4.198407 -0.235809 -0.000433
