program: Gaussian 09
title: 000041555
version: EM64L-G09RevD.01
frameworkgroup: C1[X(C12H7Cl3)]
method: RPBEPBE
basis: SDD
operation: Freq
keyword: #pfreq=noraman
keyword: PBEPBE/SDD
title: #p freq=noraman PBEPBE/SDD
converged: NO YES NO NO
title: Mulliken charges:
elementType: Cl Cl Cl C C C C C C C C C C C C H H H H H H H
charge: 0.018758 -0.003319 -0.039170 0.423949 0.277184 -0.323420 -0.367760 -0.358832 -0.358786 -0.046125 -0.077537 -0.232465 -0.215257 -0.215247 -0.235532 0.282481 0.245171 0.245172 0.286443 0.230866 0.230866 0.232562
chargesum: 0.00000
title: Mulliken charges with hydrogens summed into heavy atoms:
elementType: Cl Cl Cl C C C C C C C C C C C C
charge: 0.018758 -0.003319 -0.039170 0.423949 0.277184 -0.323420 -0.085279 -0.113661 -0.113615 -0.046125 -0.077537 0.053978 0.015608 0.015618 -0.002970
polarizability: 2.06901592e+02 4.76532838e+00 1.55900199e+02 -1.36733793e-03 -2.26744249e-02 9.94130572e+01
1716.lowfreq: -35.9578 -5.6707 -0.0022 0.0003 0.0020 3.3242 7.7206 53.3610 59.6681
frequency: -35.9161 53.3473 59.6681 90.1219 164.3369 166.2185 192.5692 229.8847 252.7197 272.5498 316.0213 338.4837 386.8039 397.3867 439.6721 525.1341 538.3395 571.9292 580.9057 615.4536 627.2475 703.3469 725.2726 759.7833 779.7306 799.4277 851.0633 863.7330 885.6793 921.7498 974.5719 987.6499 997.4082 998.3446 1027.1168 1078.8505 1083.9456 1108.9401 1174.0231 1181.9599 1188.4295 1273.4172 1311.4134 1345.0960 1370.1411 1376.6172 1407.4680 1429.1476 1484.8952 1549.2035 1579.6477 1585.2009 1611.9213 3126.2492 3132.1113 3143.4196 3152.7430 3167.1115 3172.8307 3182.8776
redmass: 4.0006 10.6013 7.3293 9.2014 6.6737 16.4537 26.6427 5.1408 5.2085 10.1835 24.6213 6.1882 7.9150 2.8269 5.6387 7.2092 5.4200 4.7933 4.2708 6.2969 7.4016 1.7549 4.8791 2.8951 3.6187 7.5661 1.2457 1.4175 1.4185 1.3976 1.3860 6.1969 1.3466 6.8286 2.4658 1.6015 3.9610 1.6661 1.0529 1.8922 1.1225 2.2357 1.3591 10.4662 7.1372 3.4037 3.3760 2.1947 2.6196 7.4051 8.5541 6.0503 6.2614 1.0847 1.0879 1.0927 1.0970 1.1019 1.0932 1.0938
irintensity: 0.0001 0.1232 0.4075 0.0206 0.0592 0.8159 0.0262 0.0427 0.0661 0.0085 0.4289 2.4556 4.0848 0.0370 0.8552 15.6981 3.6261 2.4991 45.0509 0.8731 11.1508 47.9202 4.4177 83.4158 5.2441 10.4897 0.0000 25.6444 11.6725 0.1009 0.0476 4.8820 0.9878 35.6728 22.7859 8.1537 8.1330 35.1775 0.0124 8.1235 0.6614 11.1988 0.4872 3.6651 0.0125 56.9454 62.8907 8.9099 12.2336 58.0871 43.6866 1.3527 1.2292 1.2825 0.2222 15.9579 32.4065 20.6733 0.0200 1.4176
temp: 298.150 k
press: 1.00000 atm
elementType: 17 17 17 6 6 6 6 6 6 6 6 6 6 6 6 1 1 1 1 1 1 1
symmnumber: 1
zpe: 390648.5 jmol-1
zpe.correction: 0.148790 hartree
zpe.thermalcorrener: 0.161111 hartree
zpe.thermalcorrenthalpy: 0.162055 hartree
zpe.thermalcorrgfe: 0.108623 hartree
zpe.sumelectzpe: -1840.617903 hartree
zpe.sumelectthermal: -1840.605582 hartree
zpe.sumelectthermalent: -1840.604638 hartree
zpe.sumelectthermalfe: -1840.658070 hartree
dipole: -1.8177 1.1582 0.0002
dipole: 2.1553
quadrupole: -96.5324 -114.7164 -102.4761
quadrupole: -2.6341 -0.0009 -0.0085
quadrupole: 8.0426 -10.1414 2.0989 -2.6341 -0.0009 -0.0085
hfenergy: -1840.7666932 hartree
pointgroup: C01 [X(C12H7Cl3)]
dipole: -0.732714 0.4268331 0.0000149 debye
dipolederiv: -0.2092735 -0.2518806 0.0000121 -0.2623332 -0.5496223 0.0000402 0.0000452 0.0000438 -0.0149134 -0.3554486 0.3279888 -0.0000225 0.3589618 -0.5160592 0.0000281 -0.0000176 0.0000392 -0.0308485 -0.3350925 -0.3007736 0.0000288 -0.358722 -0.6876438 0.0000515 0.0000262 0.0000548 -0.0553712 0.3914039 -0.0859033 -0.0000047 -0.088127 -0.0081382 0.000051 0.000008 0.0000108 -0.0309156 0.2532992 -0.0492788 0.0000182 -0.0336995 -0.0680206 -0.0000537 -0.0000532 0.0000049 0.0150244 -0.0167456 0.4624057 -0.0000134 0.5655064 0.6175861 -0.0000382 -0.0000923 -0.0000616 -0.0550593 -0.3142721 -0.1054768 -0.000003 -0.1552841 -0.2175795 0.0000305 -0.0000001 0.0000327 -0.0944873 -0.1622029 0.0086697 -0.0828902 -0.0064082 -0.1095554 0.0183049 0.0399366 0.0012129 0.0521355 -0.1622477 0.0085848 0.0828931 -0.0061619 -0.1094957 -0.0185278 -0.0398975 -0.0014066 0.0521258 0.4877589 -0.4615934 0.0000222 -0.6274798 0.6642218 -0.0000468 0.0000014 -0.000051 -0.0226168 0.4862124 0.4236391 -0.0000471 0.511382 1.0374182 -0.0000944 0.0000437 -0.0000982 -0.0515471 -0.2154118 -0.0280037 0.000007 0.0271293 -0.4641186 0.0000268 0.0000016 0.0000348 -0.0771564 -0.0245298 0.0009627 0.0940079 0.0102605 -0.1377611 -0.0000424 0.0611289 0.0006132 0.0782564 -0.0244768 0.0010696 -0.0940284 0.0102875 -0.1377473 -0.0002512 -0.0610868 -0.000922 0.0782697 0.1066253 0.0015639 0.0000034 -0.0011788 -0.1571767 -0.0000647 -0.0000225 -0.0000596 -0.0587343 0.0862469 0.0447695 -0.0000099 0.066071 0.0236102 -0.0000009 -0.000015 0.0000165 0.1440844 0.0578932 -0.0029142 0.0934353 -0.0029626 0.1316407 -0.0054243 0.0926008 -0.0030881 -0.0298445 0.057887 -0.0027838 -0.0934173 -0.002857 0.1316271 0.0056608 -0.0926011 0.0032815 -0.0298287 0.0251335 -0.0044429 0.0000023 -0.0074965 0.0931427 0.000006 -0.000005 0.00001 0.1724394 0.0032698 0.0042181 -0.0837332 0.0004408 0.1523266 0.0008798 -0.1021551 0.0028071 -0.0651304 0.0032706 0.0041098 0.0837381 0.0002791 0.1523283 -0.0005831 0.1021546 -0.0025208 -0.0651324 -0.1392995 0.0050695 0.0000013 0.0023922 0.159017 0.000048 -0.0000007 0.0000456 0.0892501 unknown
polarizability: 206.4418756|6.778139|156.359904|-0.0032206|-0.0342485|99.4130687 unknown
InChI: InChI=1S/C12H7Cl3/c13-9-6-10(12(15)11(14)7-9)8-4-2-1-3-5-8/h1-7H
charge 0 multiplicity 1
22 atoms
Cl 0.131353 -2.647795 0.0003
Cl 3.38873 -2.49728 0.000198
Cl 3.144188 3.028657 -0.00026
C  0.20635 0.146909 0.000057
C  -1.296073 0.133222 0.000053
C  0.975575 -1.047123 0.00014
C  0.886037 1.391926 -0.000072
C  -2.011847 0.144762 -1.223964
C  -2.011853 0.143113 1.224085
C  2.388422 -0.988236 0.000092
C  2.292062 1.423837 -0.000113
C  3.064165 0.248464 -0.000028
C  -3.424811 0.16228 -1.222694
C  -3.424812 0.160635 1.222838
C  -4.134978 0.17034 0.000079
H  0.305476 2.318286 -0.000112
H  -1.462538 0.134776 -2.172104
H  -1.46255 0.131869 2.172213
H  4.15626 0.281687 -0.000044
H  -3.968534 0.169268 -2.173925
H  -3.96854 0.166346 2.174078
H  -5.230581 0.183255 0.000081
