program: Gaussian 09
title: 000041529
version: EM64L-G09RevD.01
frameworkgroup: C1[X(C12H19NO)]
method: RPBEPBE
basis: SDD
operation: Freq
keyword: #p
keyword: freq=noraman
keyword: PBEPBE/SDD
title: #p freq=noraman PBEPBE/SDD
converged: YES YES NO NO
title: Mulliken charges:
elementType: O N C C C C C C C C C C C C H H H H H H H H H H H H H H H H H H H
charge: -0.461940 -0.320766 -0.061801 -0.237021 -0.055160 -0.725819 0.418619 -0.687991 -0.707740 -0.386132 -0.398329 -0.237811 -0.224423 -0.244945 0.166497 0.191193 0.225271 0.231384 0.240812 0.246796 0.209772 0.216578 0.201365 0.222310 0.238112 0.209755 0.195799 0.254926 0.281673 0.335555 0.220203 0.220581 0.222677
chargesum: 0.00000
title: Mulliken charges with hydrogens summed into heavy atoms:
elementType: O N C C C C C C C C C C C C
charge: -0.126385 -0.089382 0.104696 -0.045828 0.170111 -0.028440 0.418619 -0.047738 -0.064074 -0.131206 -0.116656 -0.017608 -0.003841 -0.022268
polarizability: 1.70405492e+02 4.86341411e+00 1.44647779e+02 1.47104575e+01 -3.02364176e+00 9.79125672e+01
1716.lowfreq: -5.7624 -4.1897 -0.0005 -0.0004 0.0002 8.3241 21.7662 47.5177 51.4858
frequency: 21.3955 47.4745 51.4698 99.4512 126.8956 133.6856 204.0068 209.4647 235.5459 245.9347 251.5679 276.1987 296.0577 315.3424 357.0522 390.3171 402.4911 424.8142 437.2577 463.5801 540.3931 550.5338 617.0420 649.4772 679.2270 702.9223 748.8740 806.6391 829.8735 850.7308 854.2501 906.2939 912.5319 926.4851 937.2486 975.3653 977.7720 990.7264 997.5616 1002.4323 1029.1158 1056.9332 1083.9608 1094.9446 1129.7507 1139.8277 1153.4111 1170.2730 1174.1643 1187.7714 1192.2276 1220.4015 1272.3561 1298.8534 1317.9380 1321.1006 1323.7173 1342.2000 1370.2599 1382.0714 1385.0017 1387.2184 1399.5050 1436.1887 1456.6705 1462.4931 1465.7306 1474.8642 1480.0146 1482.9250 1483.8186 1487.2294 1591.8514 1615.3028 2776.6148 2903.6889 2966.9442 2971.9699 2989.7270 3008.4471 3060.3508 3068.2833 3072.2158 3082.3027 3093.6989 3099.2193 3118.7532 3130.6777 3147.6853 3159.8499 3177.5261 3386.8452 3559.8515
redmass: 3.7641 2.7911 3.7771 3.1514 2.9576 3.8688 1.8273 1.4568 3.8035 1.1332 2.5178 1.1542 1.5544 1.7769 2.7302 2.6841 2.8181 3.4895 2.5217 2.8318 2.4458 3.6183 6.3992 3.5355 1.8449 1.7776 2.1992 2.8882 2.1683 2.1124 1.3661 2.0077 1.2879 1.4791 1.3620 1.7620 1.5385 5.2448 1.3211 4.8772 2.2360 1.5392 1.6394 1.9911 2.1317 2.0275 1.5442 1.0557 2.1180 1.2504 2.1054 1.4465 1.4596 1.1669 1.4093 1.3006 1.3277 1.3543 1.2207 2.9224 1.6245 1.2368 1.5724 2.1867 1.1595 1.0544 1.0586 1.0616 1.0575 1.2637 1.3310 1.3408 6.2741 6.0683 1.0797 1.0832 1.0355 1.0385 1.0362 1.0831 1.0980 1.0990 1.0978 1.0992 1.1000 1.1003 1.0845 1.0894 1.0943 1.0981 1.0951 1.0731 1.0656
irintensity: 0.2158 0.2987 0.1292 1.8441 0.5645 1.1137 0.3510 0.2997 2.0798 0.2963 15.8092 9.4355 63.2769 88.4800 0.3908 3.2469 1.3129 1.9253 0.6205 5.8969 27.5777 25.3575 0.2155 18.9747 67.9313 57.3433 49.4981 6.7075 7.6346 2.8139 2.7927 6.5033 7.5407 4.9401 0.7344 4.7531 0.1402 0.3386 1.1168 60.6284 9.1502 10.4149 5.4450 8.0634 23.3448 1.4940 83.6907 0.1442 47.2505 33.7708 32.8872 2.7583 6.4565 3.2059 6.4669 11.2390 0.3725 23.6714 28.0945 13.7721 23.8023 13.5789 15.6133 11.2322 19.2874 1.7375 8.3082 13.4913 9.6911 10.0625 18.5984 17.5974 0.3219 6.3382 140.4705 63.8353 28.0280 29.6582 16.6177 10.8241 8.0585 42.8148 80.5785 39.4644 37.2204 18.2049 0.0145 18.8806 31.1734 22.0533 6.7407 3.7638 2.8885
temp: 298.150 k
press: 1.00000 atm
elementType: 8 7 6 6 6 6 6 6 6 6 6 6 6 6 1 1 1 1 1 1 1 1 1 1 1 1 1 1 1 1 1 1 1
symmnumber: 1
zpe: 748211.1 jmol-1
zpe.correction: 0.284979 hartree
zpe.thermalcorrener: 0.300218 hartree
zpe.thermalcorrenthalpy: 0.301162 hartree
zpe.thermalcorrgfe: 0.242149 hartree
zpe.sumelectzpe: -597.541407 hartree
zpe.sumelectthermal: -597.526168 hartree
zpe.sumelectthermalent: -597.525224 hartree
zpe.sumelectthermalfe: -597.584237 hartree
dipole: -3.1547 -0.2575 -0.3263
dipole: 3.1819
quadrupole: -82.3589 -82.1599 -86.2276
quadrupole: 4.1119 4.7209 0.3402
quadrupole: 1.2232 1.4222 -2.6455 4.1119 4.7209 0.3402
hfenergy: -597.8263858 hartree
pointgroup: C01 [X(C12H19N1O1)]
dipole: -1.2367445 0.0273163 0.1920867 debye
polarizability: 169.2080728|-3.2079103|144.3116575|-18.2149608|-2.7714822|99.4461074 unknown
InChI: InChI=1S/C12H19NO/c1-9(2)13-10(3)12(14)11-7-5-4-6-8-11/h4-10,12-14H,1-3H3
charge 0 multiplicity 1
33 atoms
O  0.499899 2.596914 0.735484
N  -1.833793 -0.309883 0.450767
C  -1.214812 0.958014 -0.001974
C  0.11604 1.17709 0.803428
C  -3.093642 -0.764338 -0.200574
C  -0.978917 0.982641 -1.522466
C  1.307917 0.359414 0.31568
C  -4.276503 0.233612 -0.057096
C  -3.460795 -2.14762 0.373854
C  1.306045 -1.052514 0.453515
C  2.427297 0.991872 -0.27865
C  2.403671 -1.817169 -0.000827
C  3.526188 0.225398 -0.73003
C  3.519847 -1.181583 -0.593873
H  -1.859386 1.845318 0.25446
H  -0.099501 0.90685 1.864543
H  -2.872446 -0.889191 -1.277274
H  -1.941088 -0.31975 1.477924
H  -0.348109 1.851508 -1.780887
H  -0.45934 0.065093 -1.847261
H  -1.927345 1.072049 -2.081807
H  -5.164204 -0.126662 -0.60971
H  -4.56156 0.350544 1.006642
H  -4.015642 1.231818 -0.455108
H  -2.628121 -2.856985 0.226817
H  -4.364164 -2.552965 -0.116313
H  -3.670186 -2.080635 1.460274
H  0.431168 -1.546419 0.888168
H  2.429152 2.081365 -0.367014
H  -0.286477 3.146354 0.982327
H  2.388407 -2.907768 0.109474
H  4.388183 0.728184 -1.183975
H  4.373617 -1.774953 -0.941217
