program: Gaussian 09
title: 000005426
version: EM64L-G09RevD.01
frameworkgroup: C1[X(C13H10N2O4)]
method: RPBEPBE
basis: SDD
operation: Freq
keyword: #p
keyword: freq=noraman
keyword: PBEPBE/SDD
title: #p freq=noraman PBEPBE/SDD
converged: YES YES NO NO
title: Mulliken charges:
elementType: O O O O N N C C C C C C C C C C C C C H H H H H H H H H H
charge: -0.198523 -0.200607 -0.194842 -0.212188 -0.269419 -0.352473 -0.112058 -0.444703 -0.484637 0.163545 0.090418 0.121746 0.179036 0.193268 0.156564 -0.351660 -0.351320 -0.209700 -0.209209 0.285266 0.238572 0.272962 0.247140 0.263327 0.355531 0.270655 0.271297 0.240975 0.241036
chargesum: 0.00000
title: Mulliken charges with hydrogens summed into heavy atoms:
elementType: O O O O N N C C C C C C C C C C C C C
charge: -0.198523 -0.200607 -0.194842 -0.212188 -0.269419 0.003058 0.173208 0.066831 0.025830 0.163545 0.090418 0.121746 0.179036 0.193268 0.156564 -0.081005 -0.080024 0.031275 0.031828
polarizability: 2.41118555e+02 -5.57829103e-01 1.50959004e+02 -1.34999024e+01 3.70290936e+00 9.92178910e+01
1716.lowfreq: -11.3715 -6.5288 -5.3085 -0.0011 -0.0010 -0.0008 32.2605 40.2294 51.6111
frequency: 32.2076 40.2085 51.6019 112.5685 134.6441 139.3923 149.0429 182.9042 206.9079 211.0089 243.4996 335.4008 348.2884 369.5935 387.3087 417.1941 452.3811 454.6749 507.4980 523.1662 541.2628 570.8271 588.7753 632.2897 658.4894 674.5858 682.2065 715.0154 746.5802 753.0800 788.3296 797.1931 810.1944 837.7341 873.6206 892.9296 907.5744 975.5981 982.4841 993.8052 1007.4265 1016.8873 1042.7201 1072.5884 1090.5123 1094.1917 1169.5974 1172.9113 1173.1848 1194.8408 1213.3353 1261.9114 1285.2643 1295.0427 1308.8010 1324.1964 1330.0127 1352.4616 1364.3712 1378.6312 1417.0834 1446.1072 1454.5287 1454.8252 1482.9598 1614.2604 1619.5042 1632.0674 1644.0449 1648.2659 1681.0433 2970.0446 2989.1609 3023.6283 3083.3894 3090.3533 3141.9442 3155.3603 3166.8679 3176.5564 3481.5406
redmass: 6.7156 8.4309 6.1000 5.2628 7.4005 5.4844 8.4060 6.9625 2.5602 6.0237 6.8588 10.3443 8.8374 4.9642 4.0028 3.5227 4.5731 4.8529 5.8672 7.0323 4.2637 4.1816 8.2243 3.9857 4.8128 7.0956 6.6795 2.9451 2.6382 4.8801 5.1630 1.7172 1.3730 3.2143 4.5280 2.6235 1.4039 1.4138 2.3931 3.0811 1.3518 2.1779 2.8248 2.6185 3.6083 2.1575 1.2640 1.5586 1.7122 1.8149 3.4521 1.9334 1.4937 2.6003 1.9028 1.4204 1.5293 6.3217 1.6156 1.7464 6.0819 1.0827 2.7947 2.5059 1.0836 7.6763 7.7862 11.8198 11.4722 5.8480 12.1718 1.0811 1.0680 1.0604 1.0980 1.1003 1.0866 1.0907 1.0957 1.1004 1.0760
irintensity: 0.5369 0.7791 2.0716 3.9907 3.8668 1.2738 6.2985 0.8280 1.3702 0.1332 0.7146 24.3315 3.9521 13.4933 5.9006 0.9750 30.2428 0.3644 5.8493 8.1308 19.3338 1.0724 28.2043 4.8869 0.0439 1.9663 1.1781 78.2968 0.4433 3.4755 0.3189 31.8790 105.0509 5.8692 16.8165 14.5150 0.0101 2.2671 20.4213 20.9688 0.0032 14.9624 7.5390 20.6575 32.9725 2.6621 20.6346 4.7416 3.4261 230.9888 4.0905 205.7502 1.4943 74.5865 55.1061 17.7335 18.9627 396.6259 9.0242 7.7845 9.6541 12.8683 2.2616 11.0008 10.1259 2.4189 57.2893 384.8130 128.2629 468.5996 43.1086 22.0793 9.5306 16.6395 8.1781 6.5514 1.6647 4.8816 4.8728 20.2201 41.8008
temp: 298.150 k
press: 1.00000 atm
elementType: 8 8 8 8 7 7 6 6 6 6 6 6 6 6 6 6 6 6 6 1 1 1 1 1 1 1 1 1 1
symmnumber: 1
zpe: 557725.9 jmol-1
zpe.correction: 0.212427 hartree
zpe.thermalcorrener: 0.227678 hartree
zpe.thermalcorrenthalpy: 0.228622 hartree
zpe.thermalcorrgfe: 0.168834 hartree
zpe.sumelectzpe: -910.510309 hartree
zpe.sumelectthermal: -910.495057 hartree
zpe.sumelectthermalent: -910.494113 hartree
zpe.sumelectthermalfe: -910.553902 hartree
dipole: -4.4514 0.8214 -2.5266
dipole: 5.1840
quadrupole: -100.7423 -114.5140 -110.6905
quadrupole: 8.6204 -1.5657 -1.6506
quadrupole: 7.9066 -5.8651 -2.0416 8.6204 -1.5657 -1.6506
hfenergy: -910.7227355 hartree
pointgroup: C01 [X(C13H10N2O4)]
dipole: 1.7598108 0.1904285 1.0131601 debye
polarizability: 240.9680752|1.3182211|151.087772|-14.2561934|2.4421523|99.239603 unknown
InChI: InChI=1S/C13H10N2O4/c16-10-6-5-9(11(17)14-10)15-12(18)7-3-1-2-4-8(7)13(15)19/h1-4,9,14H,5-6H2
charge 0 multiplicity 1
29 atoms
O  -1.338711 -0.209442 -2.128349
O  0.816658 2.576118 0.082451
O  0.027847 -2.059696 0.299551
O  -5.442413 -0.399065 0.017984
N  0.088295 0.318437 0.229529
N  -3.355723 -0.281487 -0.98275
C  -1.346078 0.588232 0.213655
C  -2.074142 0.113153 1.493053
C  -3.578311 0.436651 1.391746
C  -1.976495 -0.007468 -1.067212
C  1.073885 1.348246 0.116863
C  0.67127 -0.984783 0.224018
C  2.387793 0.637918 0.065813
C  2.147232 -0.757284 0.127953
C  -4.222918 -0.115182 0.125707
C  3.688567 1.153546 -0.032536
C  3.200336 -1.682787 0.09347
C  4.761055 0.224837 -0.068399
C  4.520472 -1.171403 -0.006566
H  -1.433424 1.693031 0.131157
H  -1.63597 0.624087 2.367919
H  -1.918838 -0.972141 1.621824
H  -3.740527 1.533849 1.396848
H  -4.141173 0.031052 2.248331
H  -3.788657 -0.653861 -1.837847
H  3.861725 2.232903 -0.082796
H  3.003306 -2.758298 0.138108
H  5.790678 0.589302 -0.147323
H  5.368064 -1.864066 -0.039103
