program: Gaussian 09
title: 000041526
version: EM64L-G09RevD.01
frameworkgroup: C1[X(C16H22N4O3)]
method: RPBEPBE
basis: SDD
operation: Freq
keyword: #p
keyword: freq=noraman
keyword: PBEPBE/SDD
title: #p freq=noraman PBEPBE/SDD
converged: YES YES NO NO
title: Mulliken charges:
elementType: O O O N N N N C C C C C C C C C C C C C C C C H H H H H H H H H H H H H H H H H H H H H H
charge: -0.470847 -0.354017 -0.289061 -0.125232 -0.065107 -0.632561 -0.593728 0.173917 0.065500 0.278231 0.253516 0.583196 -0.716361 -0.720139 -0.693975 -0.574660 -0.703572 0.336458 0.107348 -0.437698 -0.521885 -0.541098 -0.026243 0.228907 0.236920 0.215298 0.228525 0.239019 0.215694 0.261650 0.258653 0.232217 0.228500 0.361461 0.239013 0.220892 0.238708 0.246843 0.226937 0.230126 0.245970 0.341771 0.320035 0.323340 0.327542
chargesum: 0.00000
title: Mulliken charges with hydrogens summed into heavy atoms:
elementType: O O O N N N N C C C C C C C C C C C C C C C C
charge: -0.109386 -0.354017 -0.289061 -0.125232 -0.065107 0.029245 0.057153 0.173917 0.065500 0.278231 0.253516 0.583196 -0.035236 -0.036900 -0.432326 -0.316007 -0.242855 0.336458 0.107348 -0.198685 0.184558 0.161935 -0.026243
polarizability: 2.85666832e+02 2.72529893e+01 2.07097367e+02 -6.76325831e+00 1.46820600e-01 1.68248271e+02
1716.lowfreq: -9.9470 -4.0300 0.0005 0.0005 0.0008 1.9898 17.0585 30.0825 32.0585
frequency: 16.8569 29.9826 32.0119 42.4545 60.2652 89.9731 98.2187 102.4462 138.4204 162.6960 179.0568 183.1630 187.5905 197.8463 214.6797 229.3702 236.4185 251.6835 270.0333 279.7598 290.6611 303.5886 319.6093 333.6327 355.2254 372.6818 400.5631 403.7830 431.4399 451.1791 455.4970 475.0302 479.9495 501.6851 516.8718 529.6572 533.2872 544.1911 567.5852 573.8921 590.7859 612.5161 631.6398 643.4594 677.3731 715.5312 745.7819 766.7869 775.8596 798.1118 830.6767 848.9199 867.8083 872.8870 907.5951 923.2359 925.9628 927.1961 935.8780 952.6054 989.9578 995.7942 1002.3929 1050.0929 1062.4682 1110.3409 1114.4172 1133.9278 1146.5374 1150.6262 1157.0272 1160.4413 1166.5762 1178.1973 1208.1467 1210.8619 1229.4260 1270.9434 1285.7855 1303.0032 1319.5326 1342.3124 1362.0114 1363.5656 1375.4393 1389.9342 1409.8622 1438.1878 1441.4698 1445.0002 1451.0993 1456.4085 1457.8669 1460.1221 1462.1374 1468.4446 1472.2240 1474.5075 1477.9914 1479.1349 1485.3388 1534.6148 1569.9149 1577.6916 1602.7072 1608.0016 1622.0072 2958.7551 2965.3817 2974.0435 2985.4794 3001.2662 3007.5422 3056.5421 3074.3972 3083.4128 3093.5389 3102.7132 3107.1996 3122.2442 3124.5280 3132.8823 3136.3794 3161.7109 3391.6549 3522.6828 3564.6114 3675.2791 3725.0110
redmass: 4.7265 4.4244 5.0693 3.9087 3.2368 3.6396 3.1502 4.9322 3.2329 1.3113 2.7433 1.7272 2.2767 2.0709 6.1036 1.4432 1.6302 2.8405 1.7706 2.4124 3.1901 3.1404 2.9819 3.7655 4.8427 4.0993 3.6158 3.3377 1.3637 2.1033 3.1033 1.5704 2.0652 3.3528 6.4120 1.5297 1.6555 1.5347 3.9760 2.1876 2.5799 3.6328 2.4512 4.1417 5.3054 8.1870 5.2166 3.4189 7.0780 5.4987 3.2590 2.3104 1.7673 2.2527 2.9552 2.2448 2.0836 1.7794 3.2114 2.0180 1.6993 4.2240 1.3913 7.0214 3.4795 1.2591 1.2613 2.0319 1.7975 1.4071 1.7531 1.5198 2.2637 1.4182 2.2587 2.5860 1.8788 3.8946 2.2624 4.1982 1.6157 2.7827 1.2391 4.4167 1.2882 1.5390 1.5703 1.2052 1.4447 2.0350 2.2962 1.0567 1.1057 1.3125 1.1112 1.0542 1.0629 1.0738 1.2220 2.7946 1.1424 3.8055 6.8674 3.6689 1.7020 5.2852 1.5351 1.0602 1.0324 1.0299 1.0345 1.0363 1.0997 1.1042 1.1051 1.1000 1.0996 1.1003 1.0921 1.1022 1.1002 1.0914 1.0989 1.0898 1.0653 1.0448 1.0439 1.1047 1.1059
irintensity: 0.8453 1.8289 0.5829 3.6202 0.0875 4.2340 16.7741 4.3299 4.9110 0.1087 1.7426 0.7005 0.5902 1.3143 7.6808 1.0245 2.5156 0.2250 0.6688 3.4787 7.3388 2.4504 9.8850 1.8165 2.6319 10.7011 20.8541 4.6795 257.7163 12.4150 5.5887 80.1403 106.3560 9.6721 5.8795 7.3376 6.7702 154.0409 23.9116 69.1829 37.1703 12.9376 68.7500 12.6179 3.4871 0.6105 9.6879 2.0286 19.6607 15.4897 4.2418 30.2585 13.7604 9.0923 1.8119 21.2048 2.3027 11.1703 12.8356 6.6467 6.2265 39.2276 3.5409 224.3636 36.5288 0.0917 1.2052 11.9986 23.8511 7.1165 13.9159 12.5545 15.4905 1.2214 34.4092 10.3303 93.4481 48.1713 20.2859 24.3544 3.9782 9.4146 30.1967 32.3026 32.9202 94.6334 47.3964 15.6560 17.1134 121.3139 62.7809 4.7652 29.8016 1.9760 3.9679 13.8906 19.1990 20.7767 7.8165 203.0692 5.3117 131.4544 58.4430 154.2909 722.9950 53.4159 180.9037 31.9579 51.9372 51.9427 28.1188 24.4058 10.0883 34.8109 28.6873 23.2108 37.7901 20.2419 25.3454 27.3786 22.0934 4.5302 12.9655 3.2556 120.4456 87.1400 118.5479 82.9462 44.5964
temp: 298.150 k
press: 1.00000 atm
elementType: 8 8 8 7 7 7 7 6 6 6 6 6 6 6 6 6 6 6 6 6 6 6 6 1 1 1 1 1 1 1 1 1 1 1 1 1 1 1 1 1 1 1 1 1 1
symmnumber: 1
zpe: 958419.9 jmol-1
zpe.correction: 0.365043 hartree
zpe.thermalcorrener: 0.388907 hartree
zpe.thermalcorrenthalpy: 0.389851 hartree
zpe.thermalcorrgfe: 0.311297 hartree
zpe.sumelectzpe: -1065.846838 hartree
zpe.sumelectthermal: -1065.822974 hartree
zpe.sumelectthermalent: -1065.822030 hartree
zpe.sumelectthermalfe: -1065.900584 hartree
dipole: 2.0771 -0.3989 0.8764
dipole: 2.2895
quadrupole: -155.5626 -119.1619 -133.7986
quadrupole: 7.3422 9.3444 -2.7365
quadrupole: -19.3882 17.0125 2.3758 7.3422 9.3444 -2.7365
hfenergy: -1066.2118809 hartree
pointgroup: C01 [X(C16H22N4O3)]
dipole: -0.8485532 -0.1204099 -0.2771215 debye
polarizability: 274.2575149|-39.9348591|214.4113071|0.4510542|-12.1983077|172.3436481 unknown
InChI: InChI=1S/C16H22N4O3/c1-16(2,21)13-11(22-3)6-9(7-12(13)23-4)5-10-8-19-15(18)20-14(10)17/h6-8,21H,5,17-18H2,1-4H3
charge 0 multiplicity 1
45 atoms
O  4.669261 -1.297419 -0.546108
O  2.948654 -2.32986 1.09522
O  2.026322 2.104401 -0.725857
N  -4.058419 0.002083 -1.124871
N  -4.610782 1.664142 0.591295
N  -2.240828 -1.442853 -0.906914
N  -5.898439 1.431745 -1.354342
C  3.939159 -0.010434 -0.582736
C  2.514842 -0.130741 0.03619
C  2.057191 -1.250898 0.782009
C  1.569936 0.948824 -0.068325
C  -0.160498 -0.28239 1.166611
C  4.762328 1.038307 0.213352
C  3.903821 0.319958 -2.092054
C  0.752767 -1.340736 1.327028
C  0.264118 0.868751 0.46319
C  -1.560574 -0.348339 1.786447
C  -2.686258 0.163778 0.906177
C  -2.994763 -0.416942 -0.374202
C  -3.543323 1.205578 1.310439
C  2.674349 -3.588882 0.366145
C  1.099779 3.229425 -0.882375
C  -4.820152 1.015777 -0.605037
H  5.78076 1.079495 -0.210839
H  4.301729 2.03848 0.154819
H  4.840081 0.742324 1.275518
H  4.937791 0.250074 -2.472249
H  3.505247 1.326326 -2.281188
H  3.291936 -0.424801 -2.629981
H  0.489182 -2.225016 1.918807
H  -0.44156 1.695502 0.342288
H  -1.760356 -1.396852 2.090068
H  -1.562573 0.244312 2.723734
H  4.450705 -1.745174 0.320323
H  -3.37556 1.704816 2.274176
H  1.639858 -3.931143 0.552102
H  3.388715 -4.325028 0.765056
H  2.84482 -3.438703 -0.715934
H  0.782169 3.629637 0.09952
H  0.209126 2.939661 -1.471869
H  1.673211 3.99419 -1.426707
H  -1.33579 -1.688012 -0.510175
H  -2.505794 -1.792776 -1.825956
H  -6.09519 0.977496 -2.241182
H  -6.486598 2.176717 -0.992211
