program: Gaussian 09
title: 000005395
version: EM64L-G09RevD.01
frameworkgroup: C1[X(C9H19NO2)]
method: RPBEPBE
basis: SDD
operation: Freq
keyword: #p
keyword: freq=noraman
keyword: PBEPBE/SDD
title: #p freq=noraman PBEPBE/SDD
converged: YES YES NO NO
title: Mulliken charges:
elementType: O O N C C C C C C C C C H H H H H H H H H H H H H H H H H H H
charge: -0.439678 -0.448010 -0.140871 0.303350 0.304811 -0.440438 -0.459742 -0.101800 -0.722619 -0.763804 -0.724708 -0.760944 0.237218 0.210825 0.179345 0.238192 0.193283 0.208490 0.227629 0.217965 0.216517 0.248990 0.204382 0.215358 0.231277 0.208960 0.200413 0.249607 0.219133 0.328030 0.358841
chargesum: 0.00000
title: Mulliken charges with hydrogens summed into heavy atoms:
elementType: O O N C C C C C C C C C
charge: -0.111647 -0.089169 -0.140871 0.303350 0.304811 0.007605 -0.042205 0.091483 -0.068535 -0.093916 -0.069112 -0.091793
polarizability: 1.18610822e+02 -1.93599262e+00 1.10942976e+02 -4.11816922e-01 1.74335965e+00 1.03061095e+02
1716.lowfreq: -10.7800 -3.5097 0.0008 0.0009 0.0010 19.2886 108.3062 111.7381 121.6499
frequency: 108.2221 111.6983 121.6450 161.0084 196.3793 218.0125 231.1013 250.3726 269.9300 286.6688 289.9187 300.3524 305.7050 325.0256 346.1725 388.8158 408.2181 420.8661 438.2377 469.8397 483.2921 498.6222 521.2486 562.2649 683.0097 788.4767 822.9984 850.1688 863.5839 882.8438 913.5397 930.2514 939.2746 940.2602 948.9632 978.7622 1001.0918 1001.5451 1032.1117 1074.0751 1083.0952 1150.0111 1179.1555 1194.3542 1206.3819 1216.9770 1230.8204 1240.0209 1248.0569 1289.6679 1292.7952 1311.9026 1347.9820 1364.2842 1370.1486 1384.0144 1392.8476 1394.8670 1444.9547 1455.4476 1456.0220 1458.9787 1469.8485 1471.5043 1478.1153 1491.2528 1492.8337 1508.9208 2943.5680 2972.5342 2985.9177 2986.7628 2994.0004 2997.6670 3004.7404 3049.6799 3068.1073 3075.0244 3076.6877 3083.3794 3088.7110 3104.6930 3114.2267 3114.5143 3118.1585 3545.3237 3562.0599
redmass: 1.5561 1.9930 2.2067 3.1072 1.5298 1.0968 1.2666 2.2768 2.6967 1.7358 2.1169 1.5318 1.8218 1.1936 2.8858 2.6024 3.0296 2.7812 3.1654 2.4134 3.0127 2.4326 4.0493 2.7310 3.6839 3.2373 4.5308 3.5551 1.5964 2.6345 2.5689 1.6567 1.5679 1.6294 1.9117 2.0485 1.9429 1.4044 1.4897 1.2733 1.8974 1.9519 2.4531 2.0431 2.0497 1.6408 1.7302 2.3732 1.6775 1.4484 1.4655 1.4368 1.4294 1.2108 1.2180 1.2118 1.3185 1.4401 1.0728 1.0615 1.0618 1.0506 1.0884 1.0559 1.0546 1.0552 1.0507 1.0501 1.0831 1.0625 1.0369 1.0368 1.0365 1.0385 1.0584 1.0986 1.1028 1.0994 1.0991 1.0989 1.0972 1.1000 1.0981 1.0980 1.0968 1.0659 1.0679
irintensity: 0.1467 0.0204 0.7062 1.2215 0.4206 4.0560 1.1370 13.3107 2.8156 1.6608 29.0241 65.6096 24.5377 133.3592 8.0192 0.8645 1.0126 2.7719 0.1167 4.7651 4.2334 2.4955 8.0660 2.7864 19.9309 2.4086 15.0947 22.2136 2.7732 8.3653 1.7296 0.5624 5.3686 0.9246 8.6030 26.9923 34.3130 3.2935 5.3094 6.6694 13.7379 25.8245 27.7893 29.9368 26.1858 23.4010 24.4806 20.0948 37.1290 2.9569 8.0603 20.3789 37.5915 5.7319 29.3383 25.3437 18.4330 12.8822 3.1718 6.4850 6.0206 5.2321 18.0307 0.1961 4.9436 0.0756 16.9687 16.7360 51.7327 39.4227 37.3850 19.8616 19.9338 48.5975 19.7470 15.9597 19.9492 6.9157 23.1873 72.8749 30.2231 8.3772 6.8821 38.5847 44.5070 2.3651 17.0132
temp: 298.150 k
press: 1.00000 atm
elementType: 8 8 7 6 6 6 6 6 6 6 6 6 1 1 1 1 1 1 1 1 1 1 1 1 1 1 1 1 1 1 1
symmnumber: 1
zpe: 711033.9 jmol-1
zpe.correction: 0.270819 hartree
zpe.thermalcorrener: 0.284867 hartree
zpe.thermalcorrenthalpy: 0.285811 hartree
zpe.thermalcorrgfe: 0.232803 hartree
zpe.sumelectzpe: -558.493038 hartree
zpe.sumelectthermal: -558.478989 hartree
zpe.sumelectthermalent: -558.478045 hartree
zpe.sumelectthermalfe: -558.531053 hartree
dipole: -1.3263 -1.1558 1.5423
dipole: 2.3396
quadrupole: -71.7654 -75.6328 -76.3721
quadrupole: -5.6541 0.3351 5.5318
quadrupole: 2.8247 -1.0427 -1.7820 -5.6541 0.3351 5.5318
hfenergy: -558.7638565 hartree
pointgroup: C01 [X(C9H19N1O2)]
dipole: 0.523809 0.4532391 0.606168 debye
polarizability: 118.5798213|-1.9869305|110.9580744|0.4417976|-1.7821912|103.0769963 unknown
InChI: InChI=1S/C9H19NO2/c1-8(2)5-7(11)6-9(3,4)10(8)12/h7,11-12H,5-6H2,1-4H3
charge 0 multiplicity 1
31 atoms
O  -0.072829 -3.120862 -0.460375
O  0.00653 1.256938 -1.680225
N  0.003015 1.187025 -0.149532
C  -1.299744 0.443441 0.188162
C  1.309035 0.455256 0.190298
C  -1.256981 -1.03606 -0.297385
C  1.270816 -1.025185 -0.302016
C  0.006376 -1.777278 0.156077
C  -1.565459 0.548217 1.716404
C  -2.457843 1.189881 -0.519971
C  1.569036 0.553641 1.719904
C  2.465811 1.210723 -0.510243
H  -1.276899 -1.053743 -1.402857
H  -2.151956 -1.575439 0.064854
H  2.181697 -1.54773 0.057487
H  1.28784 -1.032282 -1.408248
H  0.013871 -1.894285 1.261716
H  -0.988788 -0.171209 2.317319
H  -1.340688 1.568041 2.074472
H  -2.635053 0.345028 1.903952
H  -2.47909 2.25127 -0.209988
H  -2.354398 1.138726 -1.614549
H  -3.420873 0.727796 -0.236977
H  2.639484 0.358063 1.912049
H  1.335588 1.570507 2.0804
H  0.992784 -0.170404 2.315563
H  3.431637 0.756433 -0.223125
H  2.367239 1.163199 -1.60539
H  2.476353 2.27129 -0.197193
H  0.760019 -3.614635 -0.245926
H  -0.011329 2.237437 -1.827259
