program: Gaussian 09
title: 000041473
version: EM64L-G09RevD.01
frameworkgroup: C1[X(C5H10N4O2)]
method: RPBEPBE
basis: SDD
operation: Freq
keyword: #p
keyword: freq=noraman
keyword: PBEPBE/SDD
title: #p freq=noraman PBEPBE/SDD
converged: YES YES NO NO
title: Mulliken charges:
elementType: O O N N N N C C C C C H H H H H H H H H H
charge: -0.273663 -0.274930 -0.058370 -0.059050 0.051000 0.050931 -0.386680 -0.371589 -0.362806 -0.405712 -0.379102 0.232001 0.230779 0.235520 0.251250 0.229389 0.248747 0.272798 0.237758 0.267884 0.263845
chargesum: 0.00000
title: Mulliken charges with hydrogens summed into heavy atoms:
elementType: O O N N N N C C C C C
charge: -0.273663 -0.274930 -0.058370 -0.059050 0.051000 0.050931 0.076100 0.115181 0.115330 0.104844 0.152627
polarizability: 1.11596442e+02 1.06179102e-01 9.43459851e+01 1.04548729e+01 4.87046498e-01 6.57251816e+01
1716.lowfreq: -2.3953 -0.0006 0.0007 0.0007 7.6392 16.2026 53.3137 58.7195 117.2938
frequency: 53.2527 58.6730 117.2802 167.4765 254.1726 283.2206 294.9233 334.1676 341.3123 361.2610 369.9206 426.9203 505.8951 544.4158 628.3192 644.2774 733.0036 795.8648 838.9960 867.1281 885.8454 922.4183 967.1891 992.8147 1002.0746 1063.9774 1089.4900 1108.9375 1180.9680 1184.2048 1233.3416 1259.5802 1274.4955 1316.9605 1319.8540 1330.8441 1333.5670 1338.5528 1341.7152 1357.1711 1368.0209 1378.4236 1432.4276 1450.7095 1461.3088 1463.6473 1474.1620 2985.1102 3001.7020 3002.8591 3004.7184 3019.3407 3053.7258 3065.2776 3075.5142 3081.7970 3093.7708
redmass: 6.0661 4.6531 4.4660 2.6419 7.8484 5.1351 3.6170 3.6680 2.6542 2.4511 4.4949 3.5486 2.9501 3.3988 2.8387 2.8518 4.2575 4.3936 1.9597 2.0913 2.6091 2.4681 2.7669 2.6307 3.0529 2.3130 1.9327 1.8863 1.9978 1.9467 1.2304 1.8480 2.2874 2.4397 1.6518 1.9696 1.3466 1.3809 1.4314 1.3174 1.8614 2.1590 1.1108 1.0794 1.0836 1.0830 1.0815 1.0637 1.0623 1.0597 1.0616 1.0594 1.1003 1.1028 1.0990 1.1006 1.1045
irintensity: 8.6541 3.2520 6.2207 2.1035 0.9384 4.2522 5.5242 1.2882 2.3040 3.3119 1.6892 0.0872 0.9205 11.0625 1.0960 1.1479 2.2631 24.8432 12.1310 18.1727 103.9244 61.5939 81.3559 66.3509 14.7569 44.0272 8.2730 41.4913 14.1412 5.8015 5.2300 6.1239 57.4426 70.1971 79.2384 64.9888 1.9512 22.9400 7.5249 4.0453 16.7060 49.1532 22.6156 14.8259 12.8147 23.0603 9.7763 26.6729 15.1662 18.3660 37.1681 14.5922 8.1652 7.3678 25.4287 9.3847 5.7546
temp: 298.150 k
press: 1.00000 atm
elementType: 8 8 7 7 7 7 6 6 6 6 6 1 1 1 1 1 1 1 1 1 1
symmnumber: 1
zpe: 433867.6 jmol-1
zpe.correction: 0.165251 hartree
zpe.thermalcorrener: 0.175612 hartree
zpe.thermalcorrenthalpy: 0.176556 hartree
zpe.thermalcorrgfe: 0.128870 hartree
zpe.sumelectzpe: -564.984503 hartree
zpe.sumelectthermal: -564.974143 hartree
zpe.sumelectthermalent: -564.973198 hartree
zpe.sumelectthermalfe: -565.020884 hartree
dipole: -1.0722 3.7821 1.2300
dipole: 4.1190
quadrupole: -93.2888 -61.6985 -61.5891
quadrupole: -2.6488 -6.0610 -1.6115
quadrupole: -21.0967 10.4937 10.6030 -2.6488 -6.0610 -1.6115
hfenergy: -565.1497549 hartree
pointgroup: C01 [X(C5H10N4O2)]
dipole: 0.4382574 -1.489691 0.4636129 debye
dipolederiv: -0.3713005 -0.0163887 0.0906187 -0.6988101 -0.8775948 0.467395 0.1746371 0.0565697 -0.3124489 -0.6736486 0.0826447 0.1025381 0.8529034 -0.6217692 -0.2881608 0.4334061 -0.181037 -0.3337796 -0.6540644 -0.3774015 0.2044624 -0.0991083 -0.3726322 0.1170864 0.2576108 0.327916 -0.4434359 -0.9120811 0.396192 0.1817912 0.0026159 -0.2476186 0.0487658 0.0734116 -0.0871256 -0.3106467 0.5358323 0.4518595 -0.4715819 0.7847496 0.5922634 -0.5476257 -0.5841128 -0.4502093 0.3406434 1.2702253 -0.4364519 -0.4276217 -0.7644491 0.2280148 0.242869 -0.6186548 0.2313329 0.1052308 0.0627244 0.0302847 -0.0517081 0.0474034 -0.0321228 0.0435822 -0.0497389 0.0206258 0.0386679 0.1735719 0.0211149 0.0753842 0.0979471 0.4946376 -0.127571 0.1221314 -0.0319385 0.1975863 0.1230463 -0.1244573 -0.0187307 -0.2448942 0.4210459 0.0561539 -0.0585758 0.0878454 0.2845733 0.1888563 -0.112868 0.0567602 -0.2205324 0.1001266 0.11712 -0.0045745 0.0261337 0.2341066 0.0347639 0.1016522 0.0724072 0.2524257 0.1558703 -0.1263101 0.2108956 -0.0461341 0.1320185 0.0288482 0.0053853 0.0130155 0.0069545 -0.1658099 -0.0392912 -0.0288252 -0.0640753 0.0900025 -0.0150158 -0.0074525 0.0559221 0.0152263 0.1017533 -0.0331772 0.0607993 0.0121404 -0.0941836 0.0133469 0.0124275 -0.0664125 -0.0370317 -0.0236492 0.0568928 -0.1061584 0.1100862 -0.0930015 0.0315858 0.0450055 0.0486002 0.0074814 0.0366362 -0.0230789 0.0755166 -0.0903231 0.0205845 0.0282503 0.0496058 0.1235098 0.0363284 0.0099109 0.0623209 0.0942557 0.0177179 -0.0593954 -0.0307657 -0.094889 -0.0801004 -0.0199374 0.0153979 -0.0339231 -0.0249926 -0.007936 0.0939425 0.0022546 -0.0749483 -0.0422874 0.0071639 -0.0035618 -0.0709058 -0.0114817 0.0184335 0.1151224 0.0366987 0.0231179 0.0552176 0.0643897 0.0687042 0.0979114 0.03799 0.0626257 -0.0539126 0.0932678 0.0930974 0.0425073 -0.0177498 0.035431 -0.0365201 -0.0354743 -0.0692129 0.0984072 0.0336036 -0.0675302 0.0357083 -0.0730763 0.0849663 0.0164664 -0.0180653 0.0565644 -0.0500817 unknown
polarizability: 109.0410974|-0.4821488|94.3361774|-14.828121|-0.6243844|68.290334 unknown
InChI: InChI=1S/C5H10N4O2/c10-6-8-2-1-3-9(7-11)5-4-8/h1-5H2
charge 0 multiplicity 1
21 atoms
O  2.650186 1.484303 -0.852424
O  -3.211045 1.131214 0.623353
N  1.547158 -0.161046 0.220017
N  -1.433281 0.031071 -0.245537
N  2.539335 0.212625 -0.681279
N  -2.785787 0.035997 0.103876
C  -0.116767 -2.063958 0.250863
C  1.364218 -1.614915 0.386224
C  -0.95075 -1.258299 -0.779035
C  0.673942 0.837708 0.868837
C  -0.545539 1.186931 -0.020359
H  -0.118242 -3.129034 -0.048889
H  -0.633651 -2.01202 1.226838
H  1.758012 -1.937442 1.36998
H  1.993736 -2.077074 -0.394179
H  -0.364699 -1.077639 -1.700379
H  -1.85712 -1.826574 -1.048747
H  1.272771 1.755418 1.010938
H  0.352714 0.450786 1.850527
H  -1.165569 1.962486 0.466396
H  -0.18572 1.581163 -0.988622
