program: Gaussian 09
title: 000041544
version: EM64L-G09RevD.01
frameworkgroup: C1[X(C20H23N3O3)]
method: RPBEPBE
basis: SDD
operation: Freq
keyword: #p
keyword: freq=noraman
keyword: PBEPBE/SDD
title: #p freq=noraman PBEPBE/SDD
converged: YES YES NO NO
title: Mulliken charges:
elementType: O O O N N N C C C C C C C C C C C C C C C C C C C C H H H H H H H H H H H H H H H H H H H H H H H
charge: -0.249072 -0.250556 -0.318021 -0.078860 -0.472906 -0.228272 -0.349632 -0.344846 -0.315249 -0.328525 -0.484664 0.205678 0.291537 0.046332 0.162280 -0.347526 -0.305976 0.450948 -0.221828 -0.270724 -0.684031 -0.319837 -0.365882 -0.231787 -0.237766 -0.248098 0.209735 0.189518 0.178876 0.265095 0.211520 0.195145 0.200655 0.211935 0.216689 0.231584 0.378920 0.314206 0.255197 0.234354 0.234933 0.244761 0.240425 0.279074 0.278721 0.240510 0.228095 0.225799 0.231536
chargesum: 0.00000
title: Mulliken charges with hydrogens summed into heavy atoms:
elementType: O O O N N N C C C C C C C C C C C C C C C C C C C C
charge: -0.249072 -0.250556 -0.318021 -0.078860 -0.093985 -0.228272 0.049621 0.099125 0.091416 0.084065 -0.036391 0.205678 0.291537 0.046332 0.162280 -0.033320 -0.050779 0.450948 0.012526 -0.035791 0.080229 -0.041116 -0.125373 -0.003692 -0.011967 -0.016562
polarizability: 3.46562031e+02 3.87678781e+01 2.89699657e+02 -1.07119433e+01 9.75755396e+00 1.67012490e+02
1716.lowfreq: -14.1403 -6.9724 -3.8241 -0.0008 -0.0007 -0.0003 5.7996 15.4858 27.8078
frequency: -7.0578 14.1108 27.7306 31.8700 40.9174 60.2360 77.3762 93.7864 115.5396 121.4401 145.8471 166.9646 181.6499 203.2459 228.0297 241.3222 251.9428 276.5371 282.9393 300.3994 327.7855 329.1356 365.4460 383.8087 395.9666 401.9694 408.6719 416.8723 440.1901 469.1952 474.7210 515.5280 524.2445 564.9392 572.6489 591.8822 613.8655 621.9621 630.9651 688.4515 688.6584 696.4173 724.6037 764.3779 765.0118 769.4379 782.2997 800.7137 812.4608 826.6662 841.9068 846.7785 877.2990 894.8368 898.8849 903.4166 932.1909 966.2300 969.7093 977.4837 984.5359 989.6508 1003.3181 1009.6074 1013.0475 1029.8424 1032.1602 1046.2967 1053.6320 1084.2997 1090.4646 1096.8597 1104.7175 1114.4925 1116.6914 1134.7816 1150.4850 1175.3604 1175.6544 1187.3250 1190.7205 1193.2716 1204.8758 1229.0393 1236.2896 1252.1558 1266.9795 1280.4905 1295.3554 1305.1231 1316.0933 1330.0925 1339.4578 1340.7784 1365.0219 1370.2915 1372.7048 1383.3127 1384.1638 1430.1228 1438.5247 1440.7112 1443.9602 1447.0992 1447.5163 1450.7132 1454.0942 1465.2631 1480.5846 1487.2662 1497.5749 1504.1520 1551.7025 1583.1941 1588.8700 1611.9839 1616.3390 1636.4622 2813.4205 2853.2955 2864.8791 2955.4006 2966.1417 2980.8585 3015.2897 3021.9059 3060.4767 3077.1839 3077.9671 3085.9182 3130.3815 3133.3084 3140.5465 3143.5665 3151.6140 3161.9357 3165.8835 3177.2443 3194.7305 3202.6551 3259.7424
redmass: 3.7716 4.3410 5.7780 5.1351 4.1095 5.0780 4.3926 5.7123 4.3246 6.4165 3.6581 4.0603 5.3126 3.2915 3.4111 2.6553 2.6869 1.8224 4.1957 2.3826 4.1971 3.8246 3.1611 6.8409 2.0904 3.2191 3.7541 3.5061 5.4914 2.8764 4.3895 3.2280 3.4340 4.1656 2.7966 5.1091 6.2892 2.8102 5.4553 3.9630 2.2296 5.0372 5.1024 3.1623 1.8275 2.5965 2.0510 4.1313 3.8783 1.2799 2.0054 2.7621 1.3008 1.6214 1.9154 1.4461 4.8676 1.3758 1.3580 2.2050 5.1842 1.3446 1.3211 4.2190 2.6183 2.1719 2.2814 2.0840 2.0322 3.5238 2.0139 1.9530 2.1684 1.9994 1.3073 2.5722 2.5556 1.1341 1.0992 2.1598 2.2182 1.1002 1.1518 1.2188 2.7221 1.9310 1.3240 1.3813 1.4296 1.7687 2.3908 1.3773 1.5234 1.3307 1.6020 1.4823 2.7252 4.8620 1.8921 2.4521 2.5830 1.1143 1.0845 2.2475 1.2672 1.0950 1.1040 1.1096 1.2285 1.7533 1.4810 1.7205 3.9171 4.6458 6.1723 5.9992 6.2755 3.2791 1.0698 1.0706 1.0688 1.0662 1.0663 1.0401 1.0858 1.0894 1.1003 1.0894 1.0970 1.0977 1.0853 1.0860 1.0906 1.0915 1.0955 1.0962 1.0986 1.0955 1.0952 1.0944 1.0805
irintensity: 0.0767 0.2200 0.0598 0.2040 1.6467 0.8164 1.3283 4.3627 5.2464 2.4380 7.6787 2.7420 0.9888 2.0566 0.6556 1.2044 5.2972 0.8013 3.6175 14.8830 3.1832 17.2783 2.2761 0.4550 0.7858 3.2315 6.3887 0.5721 12.7182 0.3923 8.5515 8.9347 4.7634 2.0193 2.7601 5.4644 0.4715 2.2902 43.6644 30.5442 28.6363 4.0329 10.2279 29.4248 61.8123 14.6368 58.2349 6.3578 25.9230 0.7797 0.6442 1.0062 66.2149 12.2188 32.0972 4.0750 49.8359 0.0650 8.2810 0.9598 0.3797 0.2117 2.7006 51.8310 27.7675 12.4495 47.9973 23.0985 25.7634 38.8992 1.1056 108.6376 3.1179 52.9258 2.9873 8.5919 150.8641 2.4499 11.5251 63.2402 58.4976 6.3322 1.3563 21.0299 34.4996 3.4443 48.0926 26.3343 86.9068 63.6207 517.7616 4.8327 114.9079 60.2581 1.1950 11.1446 35.3022 0.1221 12.0446 5.4923 122.7526 5.3862 1.5999 7.6959 20.4028 13.6275 8.7263 8.7798 60.6400 160.2764 266.2127 377.4705 32.5090 383.8943 6.6551 32.6463 73.9662 25.0547 81.6048 46.7039 148.0137 55.1496 78.1958 46.4305 15.8155 52.5505 20.2426 9.8599 40.9176 41.7197 2.0133 0.5008 16.9488 19.4306 5.1022 37.5643 21.3526 13.0622 9.3935 1.0901 321.0260
temp: 298.150 k
press: 1.00000 atm
elementType: 8 8 8 7 7 7 6 6 6 6 6 6 6 6 6 6 6 6 6 6 6 6 6 6 6 6 1 1 1 1 1 1 1 1 1 1 1 1 1 1 1 1 1 1 1 1 1 1 1
symmnumber: 1
zpe: 1045532.8 jmol-1
zpe.correction: 0.398222 hartree
zpe.thermalcorrener: 0.420769 hartree
zpe.thermalcorrenthalpy: 0.421713 hartree
zpe.thermalcorrgfe: 0.344361 hartree
zpe.sumelectzpe: -1163.942966 hartree
zpe.sumelectthermal: -1163.920419 hartree
zpe.sumelectthermalent: -1163.919475 hartree
zpe.sumelectthermalfe: -1163.996827 hartree
dipole: -6.1601 0.7793 1.0269
dipole: 6.2936
quadrupole: -163.0484 -143.8270 -148.6513
quadrupole: -2.0016 -9.6576 4.9732
quadrupole: -11.2061 8.0152 3.1910 -2.0016 -9.6576 4.9732
hfenergy: -1164.3411881 hartree
pointgroup: C01 [X(C20H23N3O3)]
dipole: -2.3873031 -0.1417392 -0.6415986 debye
polarizability: 342.8736999|-44.5015571|281.907771|15.3301746|31.8221217|178.4927072 unknown
InChI: InChI=1S/C20H23N3O3/c1-22(16-7-3-2-4-8-16)20(25)17-9-5-6-10-18(17)21-19(24)15-23-11-13-26-14-12-23/h2-10,21H,11-15H2,1H3
charge 0 multiplicity 1
49 atoms
O  7.123425 1.724282 0.485307
O  3.120175 -1.618818 -0.478488
O  -1.20529 0.710717 0.532532
N  4.370778 0.795509 0.501425
N  1.002505 -0.691118 -0.038514
N  -3.036541 0.161202 -0.832859
C  4.765924 2.045728 1.200946
C  5.257278 0.552826 -0.670095
C  6.237757 1.950175 1.638079
C  6.718774 0.485917 -0.207198
C  2.94082 0.772435 0.166865
C  2.394485 -0.639483 -0.140498
C  0.141254 -1.786438 -0.275865
C  -1.278925 -1.546043 -0.328259
C  -1.823846 -0.156934 -0.184518
C  0.628548 -3.113674 -0.438355
C  -2.158502 -2.659495 -0.414843
C  -3.875298 1.252564 -0.395334
C  -0.271456 -4.188075 -0.566373
C  -1.670637 -3.973652 -0.527235
C  -3.352482 -0.443324 -2.15057
C  -3.806135 1.756601 0.935429
C  -4.853023 1.793566 -1.275192
C  -4.686441 2.771109 1.35752
C  -5.727492 2.813709 -0.839587
C  -5.652152 3.313297 0.477065
H  4.127961 2.17865 2.096018
H  4.639754 2.946378 0.547076
H  5.147234 1.370748 -1.428131
H  4.969857 -0.406029 -1.13118
H  6.577933 2.895158 2.093726
H  6.351174 1.119277 2.36756
H  6.850379 -0.382244 0.472967
H  7.403508 0.393588 -1.066218
H  2.692364 1.423567 -0.714908
H  2.375009 1.185722 1.024199
H  0.494204 0.146423 0.304634
H  1.707671 -3.274825 -0.441958
H  -3.238647 -2.482153 -0.370779
H  0.124638 -5.204043 -0.672605
H  -2.366031 -4.817213 -0.580262
H  -3.273787 0.323461 -2.944105
H  -4.372795 -0.866008 -2.162956
H  -2.632656 -1.23752 -2.380611
H  -3.058364 1.371179 1.628839
H  -4.950906 1.431746 -2.301336
H  -4.613144 3.141405 2.386089
H  -6.469811 3.213695 -1.539265
H  -6.329949 4.105153 0.81252
