program: Gaussian 09
title: 000041447
version: EM64L-G09RevD.01
frameworkgroup: C1[X(C8H12O)]
method: RPBEPBE
basis: SDD
operation: Freq
keyword: #pfreq=noraman
keyword: PBEPBE/SDD
title: #p freq=noraman PBEPBE/SDD
converged: NO YES NO NO
title: Mulliken charges:
elementType: O C C C C C C C C H H H H H H H H H H H H
charge: -0.303446 -0.140636 -0.170773 -0.137295 -0.112054 -0.484886 -0.459391 -0.461577 -0.438819 0.249808 0.243742 0.251117 0.238850 0.233929 0.204314 0.213918 0.211811 0.206362 0.223320 0.205944 0.225762
chargesum: 0.00000
title: Mulliken charges with hydrogens summed into heavy atoms:
elementType: O C C C C C C C C
charge: -0.303446 0.109172 0.072969 0.113821 0.126796 -0.046642 -0.033662 -0.031895 -0.007113
polarizability: 8.61812000e+01 1.47914393e+00 8.15349930e+01 9.80148091e-01 1.45546499e+00 7.02828716e+01
1716.lowfreq: -15.4719 -0.0010 -0.0009 -0.0008 20.5040 31.6177 80.4662 172.3545 239.4224
frequency: 80.2125 172.3390 239.4128 324.6650 369.3992 389.2263 568.2882 574.5310 649.7534 731.9926 753.3520 777.4253 795.4260 807.8446 855.6495 893.9161 903.6541 918.8453 959.4777 990.7358 1004.7981 1018.3033 1044.7177 1048.9944 1069.2206 1121.7577 1136.6004 1149.5059 1172.7913 1192.7073 1200.9758 1240.7042 1272.6259 1274.2481 1281.8306 1292.9878 1300.0032 1304.4824 1317.1159 1330.3092 1378.9933 1451.9978 1467.6705 1472.1183 1482.7247 2984.1666 2986.0470 2987.4790 2994.0562 3024.3996 3044.8637 3046.2537 3049.1602 3061.9388 3070.7268 3111.8823 3131.1177
redmass: 2.5051 3.1102 2.1267 2.8414 2.2177 3.3462 2.2584 3.0350 5.3354 3.6645 4.7876 3.4326 2.7203 2.0159 2.0481 1.7088 2.4491 1.9267 2.0080 1.6448 1.6307 1.5233 1.3007 1.8596 1.6201 1.8809 1.5149 1.4621 1.4563 1.3165 1.2463 1.3502 1.4307 1.3695 1.4878 1.3941 1.4099 1.4394 1.5577 1.5833 3.0319 1.0902 1.0854 1.0835 1.0975 1.0635 1.0595 1.0628 1.0651 1.0859 1.0927 1.0987 1.1019 1.0982 1.1003 1.0879 1.0987
irintensity: 1.2658 1.9004 2.5948 3.5618 5.3854 4.4806 0.1741 4.3039 4.9077 3.9979 7.4038 6.8242 22.0793 10.1680 1.2817 3.6438 3.6207 10.6485 0.9747 2.2519 2.7738 4.5583 0.4940 1.3323 0.2964 0.2770 4.3694 0.3007 0.7929 1.3981 0.0323 4.1440 8.2256 0.2081 1.9984 3.8563 1.5248 1.1482 1.6022 1.2827 10.0780 5.4974 11.5021 10.3448 9.2427 18.5363 34.8160 49.4871 35.4148 21.0140 9.3851 30.5621 16.7639 57.4411 83.8056 19.1908 41.7079
temp: 298.150 k
press: 1.00000 atm
elementType: 8 6 6 6 6 6 6 6 6 1 1 1 1 1 1 1 1 1 1 1 1
symmnumber: 1
zpe: 480159.6 jmol-1
zpe.correction: 0.182883 hartree
zpe.thermalcorrener: 0.190286 hartree
zpe.thermalcorrenthalpy: 0.191230 hartree
zpe.thermalcorrgfe: 0.151025 hartree
zpe.sumelectzpe: -386.528794 hartree
zpe.sumelectthermal: -386.521392 hartree
zpe.sumelectthermalent: -386.520448 hartree
zpe.sumelectthermalfe: -386.560652 hartree
dipole: -2.3065 0.1203 1.3564
dipole: 2.6785
quadrupole: -61.6582 -51.9672 -53.3423
quadrupole: 1.1149 4.6790 0.0776
quadrupole: -6.0023 3.6887 2.3136 1.1149 4.6790 0.0776
hfenergy: -386.7116775 hartree
pointgroup: C01 [X(C8H12O1)]
dipole: 0.869808 0.1093108 -0.5847714 debye
dipolederiv: -0.7110382 -0.0850786 0.1210476 -0.0382414 -0.364361 -0.0116727 0.1957949 0.0370321 -0.4663319 -0.0559129 -0.0305884 0.0003549 0.0006531 -0.0439708 -0.0466024 -0.0591501 -0.0341025 0.116174 0.4128021 0.0334671 0.0270988 0.0434612 0.1976198 0.0469732 0.0351943 0.0832172 0.1436302 0.0603152 -0.0178933 -0.0174534 -0.001673 0.0296071 0.0081171 0.0172972 -0.0015721 0.1256717 0.2816458 0.1545232 0.0093464 0.1134091 0.2291166 -0.0017997 0.0301941 -0.0461275 0.2506983 -0.0284112 -0.0580615 -0.095246 -0.0939847 -0.0119538 0.0429928 -0.0868515 -0.0090949 0.0400506 0.0661005 -0.0399755 0.0655117 -0.0130623 0.0433117 0.0119455 0.0417184 0.0113121 0.082184 0.067625 0.0206665 0.0530693 -0.0459156 0.0695771 -0.0448526 0.0508089 -0.0317354 0.0929197 0.0841351 -0.0153813 0.0643709 0.0031509 0.0200686 -0.0287335 0.020707 -0.0197937 0.0751651 0.0172304 0.0054909 0.0013169 -0.0046539 0.0273497 0.0776387 0.0000017 0.0977458 -0.1154441 0.0028858 -0.0173849 -0.016908 -0.0210686 -0.1161623 -0.0815138 -0.0301014 -0.0807134 0.0717599 0.0034568 0.0375778 0.0452753 0.0207878 0.0142365 -0.0639282 0.0261594 -0.0784815 -0.1260545 -0.0277191 -0.0345035 -0.1165171 -0.044282 0.0557372 0.020158 -0.1168807 0.0313812 -0.0672784 -0.0016894 0.0920629 0.0184589 0.0879414 -0.0886 -0.0327175 0.0320096 -0.0869779 0.0706758 0.0213047 -0.0769394 0.1008066 -0.0391522 0.0377951 0.0474786 0.0525531 0.0710135 -0.1043476 0.0683109 -0.0687132 -0.0366649 -0.0229193 -0.0959612 -0.1029063 -0.0073805 -0.1354115 -0.0277359 -0.0861417 0.0860389 -0.0774152 0.0438846 0.0197414 0.0522643 -0.0963727 0.0985392 -0.0381966 -0.0760865 -0.0100128 -0.1081247 0.0422998 0.0722712 0.0192864 -0.1231578 -0.0274216 -0.1023035 0.0605184 -0.0069764 0.0003503 -0.0497921 -0.173709 0.0507391 0.0381984 0.0920131 0.043971 0.0402465 0.0157041 -0.1302143 0.00042 0.0131916 0.0441566 -0.0822977 0.0339258 -0.1265599 -0.1995783 0.0159775 0.0915359 0.0187373 0.0650945 -0.0070237 0.0615554 -0.0047479 0.0613521 unknown
polarizability: 86.500377|-1.0418536|81.136747|0.3419007|-1.8270058|70.3619407 unknown
InChI: InChI=1S/C8H12O/c1-2-5-4-7-8(9-7)6(5)3-1/h5-8H,1-4H2
charge 0 multiplicity 1
21 atoms
O  -2.287534 -0.440095 0.652164
C  0.225196 -0.732699 0.67968
C  -1.081448 -1.07009 -0.027202
C  0.291133 0.848317 0.704377
C  -1.689932 0.169823 -0.605361
C  -0.786073 1.358642 -0.318149
C  1.502469 -1.209476 -0.090938
C  1.746047 1.186534 0.279872
C  2.102682 0.070858 -0.735473
H  0.20417 -1.14819 1.703425
H  -1.264491 -2.074101 -0.427967
H  0.056378 1.237066 1.709313
H  -2.364473 0.161432 -1.46938
H  -1.357237 2.215755 0.08126
H  -0.310662 1.686896 -1.264728
H  1.275017 -1.992077 -0.838922
H  2.228349 -1.643544 0.621778
H  2.423089 1.123466 1.154455
H  1.840133 2.204865 -0.140867
H  1.614279 0.27423 -1.708362
H  3.188207 -0.013214 -0.922673
