program: Gaussian 09
title: 000005480
version: EM64L-G09RevD.01
frameworkgroup: C1[X(C17H20N2O2S)]
method: RPBEPBE
basis: SDD
operation: Freq
keyword: #p
keyword: freq=noraman
keyword: PBEPBE/SDD
title: #p freq=noraman PBEPBE/SDD
converged: YES YES NO NO
title: Mulliken charges:
elementType: S O O N N C C C C C C C C C C C C C C C C C H H H H H H H H H H H H H H H H H H H H
charge: 0.243061 -0.287952 -0.347368 -0.100771 -0.604467 -0.385501 -0.470174 -0.396991 0.477515 -0.440571 -0.485888 0.079817 -0.236179 0.445886 0.200744 -0.376778 -0.448127 -0.232133 -0.221889 -0.245194 -0.214156 -0.676460 0.187229 0.215429 0.230595 0.229619 0.254921 0.200773 0.225045 0.188190 0.270363 0.231289 0.386163 0.311712 0.225036 0.223857 0.226581 0.225278 0.226208 0.211326 0.228510 0.225453
chargesum: 0.00000
title: Mulliken charges with hydrogens summed into heavy atoms:
elementType: S O O N N C C C C C C C C C C C C C C C C C
charge: 0.243061 -0.287952 -0.347368 -0.100771 0.093408 0.017157 -0.009960 0.058702 0.477515 -0.440571 -0.072653 0.079817 -0.236179 0.445886 0.200744 -0.106415 -0.216838 -0.007097 0.001967 -0.018613 0.237330 -0.011170
polarizability: 2.94561994e+02 -2.20612657e+01 2.12321383e+02 1.36077264e+01 7.85411947e+00 1.60046924e+02
1716.lowfreq: -7.2234 -4.8879 -3.4346 -0.0013 -0.0008 -0.0005 19.4415 28.8253 33.7816
frequency: 19.3945 28.8150 33.7376 40.7431 69.5249 76.8787 85.2012 121.0021 126.3279 158.7235 167.2672 193.8670 197.3842 239.5233 255.4656 267.1755 287.7720 292.6974 307.3880 323.0244 349.5841 379.8929 381.7221 388.2327 395.0096 406.1472 452.3354 487.7049 504.4412 527.3965 561.1801 587.0615 604.8196 616.9973 623.2062 703.0920 705.1817 714.6438 743.0958 758.7404 765.1443 796.6861 798.1694 806.7873 811.9643 859.3046 860.3489 914.1765 945.7353 962.7575 975.0753 983.2664 989.8370 996.8657 1001.0469 1017.8905 1024.4216 1028.6492 1055.3618 1077.4736 1079.5574 1110.8024 1124.8788 1135.2736 1139.9808 1169.4497 1172.1513 1179.0259 1187.3342 1208.8633 1216.8045 1234.0257 1245.7923 1260.6015 1278.8747 1305.4215 1310.7072 1330.7070 1335.4107 1359.1765 1368.1960 1378.3915 1393.8806 1396.5737 1403.9480 1440.3810 1446.2891 1457.2193 1462.4763 1469.0138 1473.5777 1477.2680 1482.2837 1484.7129 1488.3301 1573.7290 1594.2287 1599.9220 1614.6485 1621.2278 2802.1198 2834.3553 2853.0530 2990.9092 2993.4447 2997.1847 3003.9191 3009.0254 3034.2168 3064.4711 3066.1130 3089.9486 3104.6032 3111.0350 3122.4196 3134.8717 3146.0972 3160.7902 3320.8012 3648.1424
redmass: 4.5102 3.8953 4.2937 3.4201 3.0653 3.8027 4.2470 3.9356 3.2323 4.7669 3.9088 3.9904 3.8140 1.6236 1.8184 3.7306 3.1602 4.6337 4.4550 3.1003 2.7782 7.2262 1.3990 3.1414 3.8459 2.8704 3.3974 5.3809 4.9718 3.8120 4.1319 5.0517 5.3894 6.4130 6.2692 6.2503 2.1996 2.3627 1.5124 1.7273 3.9013 2.3231 1.2206 4.0464 3.6950 3.1012 1.2512 1.3740 2.9460 2.8561 2.1882 1.3894 5.8387 1.7872 1.4754 2.2890 2.2720 2.0749 2.1884 2.7183 1.5853 2.2286 3.5423 1.4601 2.3685 1.0661 3.0905 1.1210 1.0930 2.0318 1.3485 1.3747 1.1364 2.4715 1.6597 1.5975 1.3947 2.0283 1.5066 1.6618 1.9686 2.7578 2.2167 1.4623 2.8187 2.0883 1.1061 1.1173 1.0408 1.0923 1.0774 1.1797 1.9576 1.8756 1.2676 11.1830 6.1758 1.7114 6.1386 6.4481 1.0717 1.0707 1.0708 1.0859 1.0357 1.0647 1.0842 1.0581 1.0879 1.0968 1.1062 1.0985 1.1026 1.0870 1.0861 1.0914 1.0956 1.1014 1.0596 1.0907
irintensity: 0.0603 0.0382 0.3210 0.1015 1.1292 0.3127 1.7311 0.3935 3.8159 3.3300 1.3181 0.6845 2.6374 7.5892 2.6398 4.2680 4.0766 1.9870 0.6657 4.6317 7.3002 8.4483 96.0626 26.8912 7.9553 0.5998 7.5758 6.9044 5.3555 22.6912 5.1855 11.2969 2.2891 0.0984 1.4501 8.5694 32.0345 29.8957 58.8717 101.6054 10.1483 5.5496 6.6701 7.2397 14.0214 17.8635 0.1784 3.4318 35.5064 38.9124 7.8410 0.0860 0.1680 5.3818 1.9187 12.7028 26.7533 51.8200 24.6190 271.0295 8.0081 1.1755 33.3567 5.0183 52.0190 0.4977 58.4864 3.0337 7.9965 9.6641 3.3705 10.1853 0.0278 176.4371 22.2957 14.8048 12.6010 30.8458 36.0335 16.6851 7.8895 7.5459 3.0911 46.0765 11.3270 11.7356 16.2222 7.9526 12.6131 5.4784 26.9050 8.0728 12.6759 186.7142 112.2274 418.2027 0.7086 201.4417 6.8055 14.1732 66.5011 53.2893 170.9212 18.3606 21.9950 16.5718 18.3335 27.0493 49.8186 15.0015 10.0876 38.8626 47.0386 8.9878 0.2815 18.5077 32.6356 29.5118 153.5948 88.5299
temp: 298.150 k
press: 1.00000 atm
elementType: 16 8 8 7 7 6 6 6 6 6 6 6 6 6 6 6 6 6 6 6 6 6 1 1 1 1 1 1 1 1 1 1 1 1 1 1 1 1 1 1 1 1
symmnumber: 1
zpe: 887342.1 jmol-1
zpe.correction: 0.337971 hartree
zpe.thermalcorrener: 0.359166 hartree
zpe.thermalcorrenthalpy: 0.360110 hartree
zpe.thermalcorrgfe: 0.285891 hartree
zpe.sumelectzpe: -1316.202280 hartree
zpe.sumelectthermal: -1316.181085 hartree
zpe.sumelectthermalent: -1316.180141 hartree
zpe.sumelectthermalfe: -1316.254360 hartree
dipole: 0.0435 -0.4430 -0.8103
dipole: 0.9246
quadrupole: -130.6411 -123.1551 -133.7255
quadrupole: -4.9238 3.1903 2.3594
quadrupole: -1.4672 6.0188 -4.5516 -4.9238 3.1903 2.3594
hfenergy: -1316.5402508 hartree
pointgroup: C01 [X(C17H20N2O2S1)]
dipole: -0.0294288 0.1424795 -0.3333877 debye
polarizability: 291.8150349|-26.098026|211.5877538|-17.9798927|-11.2663893|163.5275115 unknown
InChI: InChI=1S/C17H20N2O2S/c1-2-21-17(20)15-13-8-9-19(11-14(13)22-16(15)18)10-12-6-4-3-5-7-12/h3-7H,2,8-11,18H2,1H3
charge 0 multiplicity 1
42 atoms
S  -0.83882 -2.799136 -0.032645
O  -3.86382 1.245127 0.365941
O  -4.912798 -0.76839 0.892741
N  1.351847 0.677063 -0.723102
N  -3.493196 -3.037086 0.753127
C  0.23802 1.46555 -1.309183
C  -1.060446 1.289277 -0.494519
C  1.101757 -0.785014 -0.81889
C  -1.330256 -0.17911 -0.226459
C  -0.311243 -1.084818 -0.39975
C  2.678995 1.042148 -1.267098
C  -2.587234 -0.784871 0.217608
C  -2.491929 -2.192195 0.364072
C  3.838753 0.517956 -0.422972
C  -3.858938 -0.147154 0.516609
C  3.751103 0.505672 0.992452
C  5.037746 0.083543 -1.038913
C  4.844402 0.074102 1.774613
C  6.136511 -0.344363 -0.257855
C  6.043408 -0.34949 1.152669
C  -5.15833 1.921236 0.675038
C  -4.940199 3.4126 0.437324
H  0.047673 1.172771 -2.374203
H  0.533014 2.531111 -1.307069
H  -1.909489 1.741782 -1.035864
H  -0.978341 1.830571 0.467152
H  1.829947 -1.306064 -0.168261
H  1.284504 -1.156152 -1.864018
H  2.723818 2.149618 -1.28977
H  2.812389 0.695411 -2.325157
H  2.812265 0.826097 1.458277
H  5.112521 0.078224 -2.134015
H  -4.395795 -2.575218 0.953676
H  -3.35644 -4.039636 0.847328
H  4.763704 0.067351 2.867818
H  7.058298 -0.677801 -0.748308
H  6.892215 -0.68367 1.760111
H  -5.94159 1.497969 0.020344
H  -5.430701 1.695605 1.721962
H  -5.871982 3.966256 0.654617
H  -4.14282 3.803717 1.092396
H  -4.657225 3.608113 -0.611426
