program: Gaussian 09
title: 000005403
version: EM64L-G09RevD.01
frameworkgroup: C1[X(C12H19NO3)]
method: RPBEPBE
basis: SDD
operation: Freq
keyword: #p
keyword: freq=noraman
keyword: PBEPBE/SDD
title: #p freq=noraman PBEPBE/SDD
converged: YES YES NO NO
title: Mulliken charges:
elementType: O O O N C C C C C C C C C C C C H H H H H H H H H H H H H H H H H H H
charge: -0.473563 -0.437336 -0.442914 -0.405282 0.265633 -0.436910 -0.184982 -0.715164 -0.680778 -0.687570 0.527256 -0.592931 -0.556956 0.361387 0.349137 -0.593603 0.263852 0.224163 0.237311 0.198870 0.232087 0.214438 0.203758 0.214764 0.228263 0.210389 0.206088 0.214446 0.227251 0.254388 0.304183 0.357267 0.211551 0.349825 0.351684
chargesum: 0.00000
title: Mulliken charges with hydrogens summed into heavy atoms:
elementType: O O O N C C C C C C C C C C C C
charge: -0.116297 -0.087511 -0.091230 -0.141430 0.265633 0.024564 0.013889 -0.064881 -0.027362 -0.039785 0.527256 -0.338544 -0.252773 0.361387 0.349137 -0.382052
polarizability: 1.94755746e+02 -1.14756094e+00 1.51964400e+02 -1.71359839e+01 -4.64437624e+00 1.06977265e+02
1716.lowfreq: -5.0541 -1.2957 -0.0005 -0.0004 0.0002 5.1733 15.0322 30.2683 38.9882
frequency: 14.9407 30.0495 38.9405 58.3115 109.7287 161.5870 174.7026 210.9432 219.1678 222.0845 230.3479 244.6097 256.0836 262.4695 306.5553 325.5786 330.5841 339.3837 353.7062 355.6859 415.1400 446.1135 465.1981 489.8671 505.2774 523.7596 552.8650 594.1140 598.1123 639.7431 673.6775 712.4672 749.4790 785.8853 805.1369 858.0341 862.6252 888.8355 902.4413 907.1928 924.2430 942.0652 962.3840 978.5441 984.7064 1005.7265 1020.6576 1042.9893 1064.0174 1085.0911 1121.5174 1130.6168 1169.5249 1174.3726 1175.8115 1211.9247 1236.4732 1256.3724 1272.2544 1277.7591 1316.6566 1321.1815 1329.5934 1374.2405 1377.7002 1399.9176 1400.9560 1407.4973 1442.6202 1449.9559 1458.8890 1461.7889 1467.0630 1474.7486 1481.6254 1487.2923 1489.5221 1493.6432 1602.4487 1640.7917 2905.9686 2960.5028 2969.9844 2974.1240 2986.3268 3063.8197 3068.5300 3071.4579 3072.8867 3081.9649 3088.2102 3094.6215 3099.5433 3153.3697 3186.2499 3192.2131 3417.4481 3580.4322 3584.7783
redmass: 4.4399 3.1169 3.4980 4.4645 2.6383 2.2673 1.9498 4.6734 2.4251 3.1593 3.4447 1.1580 1.1705 2.4911 4.6584 1.1227 1.1405 2.3258 4.3123 2.8781 2.4802 2.2103 3.3440 2.8116 5.7920 6.5550 3.8832 4.4205 3.4085 1.9119 1.9143 2.2364 3.6244 1.7093 1.1523 2.0167 2.1454 2.2159 1.4241 1.7896 1.5906 1.2088 3.9997 4.6524 4.0344 1.6951 1.4047 2.5139 2.5741 3.5124 1.5131 1.4344 1.3212 1.2757 1.3531 2.4993 2.9673 1.3238 2.1142 1.2124 1.2964 1.9771 1.7167 1.2082 1.2270 1.6669 1.2386 5.3220 1.1839 1.0684 1.0631 1.0529 1.1187 2.7435 1.0645 1.1040 2.9931 1.0606 6.5860 6.6333 1.0829 1.0662 1.0363 1.0369 1.0361 1.0986 1.0971 1.0967 1.0997 1.0980 1.1004 1.0996 1.0915 1.0920 1.0630 1.0920 1.0739 1.0660 1.0660
irintensity: 0.3187 0.6024 0.7494 4.6020 3.0322 1.8290 1.5841 0.5372 4.6709 2.5705 0.8045 1.7940 0.4989 6.1406 2.0225 191.6210 74.6075 2.2690 9.1523 2.8101 1.7077 0.2182 21.5051 2.5875 0.2713 1.0979 9.6321 1.8820 11.3133 36.3653 14.8753 29.6450 9.6523 42.9215 139.5405 21.7315 33.5292 13.7434 31.9903 0.9348 7.6385 0.3463 61.9353 25.7350 57.5405 3.0748 1.0911 17.5763 1.7341 23.7805 249.9214 65.5651 49.1380 24.0485 104.5221 73.0305 32.5065 16.7703 18.1038 27.8761 39.9008 53.0622 10.6788 31.6741 22.7915 120.1419 10.7477 8.7514 20.0186 4.5333 3.2057 0.8711 11.5076 10.5490 12.0281 8.1119 23.0793 19.1362 190.4020 115.0362 58.2406 33.5481 34.3224 38.2442 10.3237 4.1797 3.8774 73.1706 11.9066 59.5235 6.7770 74.4573 17.5058 2.9823 253.4111 2.3218 0.4248 28.5916 30.8358
temp: 298.150 k
press: 1.00000 atm
elementType: 8 8 8 7 6 6 6 6 6 6 6 6 6 6 6 6 1 1 1 1 1 1 1 1 1 1 1 1 1 1 1 1 1 1 1
symmnumber: 1
zpe: 766142.6 jmol-1
zpe.correction: 0.291808 hartree
zpe.thermalcorrener: 0.309444 hartree
zpe.thermalcorrenthalpy: 0.310388 hartree
zpe.thermalcorrgfe: 0.245399 hartree
zpe.sumelectzpe: -747.832449 hartree
zpe.sumelectthermal: -747.814814 hartree
zpe.sumelectthermalent: -747.813870 hartree
zpe.sumelectthermalfe: -747.878859 hartree
dipole: -0.5130 -2.0695 -2.7272
dipole: 3.4617
quadrupole: -62.8501 -103.7961 -100.9349
quadrupole: 3.7334 -9.2830 -5.1646
quadrupole: 26.3436 -14.6024 -11.7412 3.7334 -9.2830 -5.1646
hfenergy: -748.1242577 hartree
pointgroup: C01 [X(C12H19N1O3)]
dipole: -0.1718776 0.2220129 1.3326899 debye
polarizability: 194.5697412|-8.8295673|146.5416281|15.0479307|15.5550664|112.5860417 unknown
InChI: InChI=1S/C12H19NO3/c1-12(2,3)13-7-11(16)8-4-9(14)6-10(15)5-8/h4-6,11,13-16H,7H2,1-3H3
charge 0 multiplicity 1
35 atoms
O  -0.8074 -0.141423 -1.983288
O  3.237625 -2.727559 -0.640167
O  3.97215 1.736423 1.33668
N  -2.67059 0.684559 -0.281752
C  -3.780642 -0.027949 0.445452
C  -1.29515 0.640202 0.274195
C  -0.291157 0.718818 -0.929831
C  -5.084201 0.311528 -0.317631
C  -3.534873 -1.555896 0.389292
C  -3.897679 0.443079 1.923652
C  1.105645 0.289483 -0.507092
C  1.92678 1.201452 0.198807
C  1.556866 -1.019432 -0.782221
C  2.836009 -1.412742 -0.33741
C  3.200957 0.786864 0.637844
C  3.67267 -0.522646 0.379735
H  -2.954576 1.650866 -0.502529
H  -1.07315 1.440235 1.010859
H  -1.149203 -0.331294 0.775946
H  -0.252789 1.775249 -1.28404
H  -5.013083 -0.016677 -1.369919
H  -5.949429 -0.19126 0.149027
H  -5.28165 1.40149 -0.306132
H  -2.627649 -1.852742 0.945433
H  -3.419161 -1.889982 -0.656817
H  -4.389691 -2.092705 0.838655
H  -4.106286 1.528701 1.976345
H  -4.717655 -0.088045 2.441442
H  -2.963001 0.244946 2.479405
H  1.606391 2.228614 0.400412
H  0.929224 -1.702526 -1.357822
H  -1.807321 -0.099139 -1.824399
H  4.668861 -0.838561 0.721982
H  4.155445 -2.901454 -0.31439
H  4.855313 1.363824 1.580575
