program: Gaussian 09
title: 000041548
version: EM64L-G09RevD.01
frameworkgroup: C1[X(C23H29N3O2)]
method: RPBEPBE
basis: SDD
operation: Freq
keyword: #p
keyword: freq=noraman
keyword: PBEPBE/SDD
title: #p freq=noraman PBEPBE/SDD
converged: YES YES NO NO
title: Mulliken charges:
elementType: O O N N N C C C C C C C C C C C C C C C C C C C C C C C H H H H H H H H H H H H H H H H H H H H H H H H H H H H H
charge: -0.260846 -0.250613 -0.057830 -0.281873 -0.218438 -0.366240 -0.371196 -0.403243 -0.389972 -0.396953 -0.453692 0.170587 0.228251 -0.663661 0.185774 -0.340072 0.088977 -0.325630 -0.226344 -0.247551 0.443004 -0.666936 -0.313546 -0.352611 0.454315 -0.367134 -0.432699 -0.808310 0.249757 0.152048 0.158138 0.221577 0.185333 0.214194 0.207701 0.185720 0.183316 0.209454 0.204701 0.305041 0.283444 0.225791 0.236447 0.260980 0.248542 0.234864 0.234663 0.232897 0.252466 0.264910 0.288205 0.233331 0.233784 0.229848 0.230267 0.234906 0.222158
chargesum: 0.00000
title: Mulliken charges with hydrogens summed into heavy atoms:
elementType: O O N N N C C C C C C C C C C C C C C C C C C C C C C C
charge: -0.260846 -0.250613 -0.057830 -0.281873 -0.218438 0.035566 0.008519 -0.003716 0.003449 -0.004183 0.056050 0.170587 0.228251 0.082021 0.185774 -0.079092 0.088977 -0.077087 0.008519 -0.012888 0.443004 0.083336 -0.025341 -0.119280 0.454315 -0.133350 -0.202851 -0.120979
polarizability: 3.30813317e+02 2.01404556e+01 3.11688742e+02 8.88271611e+00 -1.99506940e+01 2.03197494e+02
1716.lowfreq: -6.1135 -0.0003 0.0003 0.0006 3.6034 4.3928 14.3703 18.7688 24.4026
frequency: 11.1376 18.5130 24.2749 38.1896 39.9246 44.6131 46.9519 62.1787 64.4461 79.4043 98.2382 100.9538 137.1477 153.2183 159.4186 173.5179 179.5250 198.5728 200.9054 216.7530 234.8477 242.7511 289.0299 293.0113 296.0450 326.3432 337.2042 347.6171 370.9304 378.6237 380.6007 401.1820 406.7342 432.8976 442.6568 451.2440 462.6165 485.8724 520.7795 549.5974 562.1821 574.3377 585.0732 626.2427 637.3368 646.0144 668.1906 702.8806 717.4964 741.9948 765.8111 775.9023 777.6944 783.3297 806.5037 816.0179 824.9331 835.1540 855.3149 856.6479 887.8981 898.2886 920.7190 941.9608 958.2595 960.2876 968.9129 983.2630 986.0305 994.2791 996.8291 1009.1062 1015.9417 1026.8876 1044.2051 1047.2439 1054.4887 1080.8511 1092.9328 1097.1362 1115.3659 1118.9261 1121.9971 1122.2601 1129.1028 1133.3756 1152.3411 1172.2370 1172.9591 1183.8208 1199.9164 1210.1884 1227.3307 1241.4996 1249.9069 1258.1459 1265.8038 1266.6243 1283.1064 1301.2053 1311.9710 1314.7087 1332.0472 1340.1826 1344.5103 1347.6472 1350.8324 1359.7876 1373.4796 1375.3347 1390.9825 1397.5478 1409.7021 1413.9008 1432.4042 1441.4873 1449.0417 1451.8650 1460.5960 1462.4595 1466.7709 1468.4596 1469.7793 1475.2650 1475.8673 1477.7294 1480.9313 1488.1278 1494.6812 1507.5842 1555.1779 1574.5754 1584.8128 1598.5174 1612.5158 1625.2929 2794.0686 2802.8213 2821.1749 2961.7377 2968.9391 2975.6333 2981.5523 2984.2374 2987.7097 3004.4988 3021.7767 3029.4782 3045.8005 3048.9707 3053.9539 3054.5031 3064.1559 3071.6592 3083.4121 3102.0214 3123.5706 3125.1990 3126.9301 3128.9362 3135.3448 3149.2699 3156.8234 3167.2754 3201.9670
redmass: 5.5527 3.9457 3.6628 3.5208 1.0453 4.0594 4.1992 4.1949 3.8160 5.9402 3.4677 3.8578 3.4056 2.1910 1.5349 2.7617 2.1718 3.0370 2.0212 2.8494 4.3131 1.9222 2.6891 3.4596 2.5532 3.9308 4.3100 3.4297 4.0739 3.6199 1.8169 5.5102 2.9419 4.7703 4.8936 2.9209 2.7086 4.2668 2.9040 2.6745 3.4210 3.8321 2.4426 6.1604 6.7350 5.6286 4.6197 7.3769 3.1632 4.3927 4.1785 1.9569 2.2006 4.4359 1.4854 2.1419 2.0366 1.4538 1.5708 2.3629 1.4578 2.8740 2.6772 1.3247 1.2886 1.3933 1.3629 2.1018 1.4550 1.3528 2.7286 3.1754 3.2125 3.6469 2.0852 1.5522 2.0578 1.3899 2.0474 1.9736 1.3956 1.8310 1.4585 1.9280 2.2283 1.3807 1.2917 1.0975 2.2778 2.4040 1.1387 1.5654 2.6167 3.2017 2.1038 1.6158 1.3532 1.4688 1.5503 1.4718 2.2591 1.3810 1.3345 1.4206 3.4686 1.7139 1.5422 10.1869 1.5084 4.9611 1.4606 1.2530 1.2340 3.0944 1.9645 1.2624 1.0937 1.1056 1.0861 1.0911 1.1335 1.1040 1.0482 1.3109 1.2085 1.1992 1.3117 1.0629 1.0925 2.5902 9.1169 6.9644 6.5398 6.8267 7.3747 6.3505 1.0712 1.0702 1.0686 1.0622 1.0340 1.0374 1.0404 1.0615 1.0615 1.0856 1.0884 1.0950 1.1032 1.1021 1.0972 1.1023 1.0884 1.0960 1.0989 1.0980 1.0963 1.0916 1.0869 1.0907 1.0889 1.0945 1.0948 1.1008 1.0943
irintensity: 1.0206 0.7027 0.3847 0.2700 0.4609 0.3682 1.0675 1.7554 1.4050 1.4421 1.1458 1.2886 7.9941 1.1353 0.2971 0.7786 0.7273 1.7199 1.6299 2.3951 0.8315 1.1333 1.1766 0.3640 6.9026 3.8043 1.9374 4.2331 0.4134 15.1458 4.0789 6.7323 0.3219 4.1518 15.8424 0.6150 2.4086 2.9837 13.6097 14.4526 6.8315 6.7783 3.1722 10.7071 2.0951 6.2348 8.8086 4.0081 0.5561 3.0821 7.2916 31.5284 40.5358 1.4373 0.1963 27.4682 12.7907 12.5994 4.2264 8.7346 1.5597 0.5927 0.6417 0.5928 3.3804 2.1004 0.3894 20.1116 6.4775 1.0120 52.8748 0.9489 103.3522 20.0175 37.5765 12.4291 10.2750 5.8229 138.6549 38.0207 5.9843 58.4832 23.3152 6.2987 3.3197 5.7760 5.6786 3.9612 43.0080 28.5848 0.5944 6.5810 1.0151 36.9015 61.3917 2.2641 13.9839 27.6778 25.3719 15.5003 34.0610 31.6000 2.0477 1.4400 271.4810 10.5551 6.4751 30.9955 7.7041 9.2681 18.2461 10.6140 32.2658 3.0256 17.7243 30.6662 10.7280 4.8883 12.7922 1.9756 9.7978 11.0440 12.3759 22.2290 9.9262 13.1705 61.4250 35.5591 19.7944 138.9027 230.1014 42.5556 31.6919 74.6880 138.1921 3.1474 56.0589 89.0174 181.8614 45.4835 62.1975 43.3702 41.5569 33.7753 43.8473 4.6929 56.5138 64.1679 24.4696 37.7443 20.3457 83.5414 15.4832 16.5516 19.9843 0.5964 33.0467 4.6587 1.9927 18.8717 3.2676 16.5036 14.5300 24.8947 0.2242
temp: 298.150 k
press: 1.00000 atm
elementType: 8 8 7 7 7 6 6 6 6 6 6 6 6 6 6 6 6 6 6 6 6 6 6 6 6 6 6 6 1 1 1 1 1 1 1 1 1 1 1 1 1 1 1 1 1 1 1 1 1 1 1 1 1 1 1 1 1
symmnumber: 1
zpe: 1246743.0 jmol-1
zpe.correction: 0.474859 hartree
zpe.thermalcorrener: 0.502674 hartree
zpe.thermalcorrenthalpy: 0.503618 hartree
zpe.thermalcorrgfe: 0.412808 hartree
zpe.sumelectzpe: -1206.475595 hartree
zpe.sumelectthermal: -1206.447781 hartree
zpe.sumelectthermalent: -1206.446837 hartree
zpe.sumelectthermalfe: -1206.537647 hartree
dipole: -3.6270 5.4477 -1.0491
dipole: 6.6282
quadrupole: -146.9312 -146.6644 -172.1874
quadrupole: 5.4757 -5.2818 1.2341
quadrupole: 8.3298 8.5966 -16.9264 5.4757 -5.2818 1.2341
hfenergy: -1206.9504546 hartree
pointgroup: C01 [X(C23H29N3O2)]
dipole: -1.4405069 2.1639604 -0.2060827 debye
polarizability: 328.9328725|19.2276115|315.3729673|18.0071652|-4.3241683|201.3937138 unknown
InChI: InChI=1S/C23H29N3O2/c1-18-11-13-19(14-12-18)24(2)23(28)20-9-5-6-10-21(20)25(3)22(27)17-26-15-7-4-8-16-26/h5-6,9-14H,4,7-8,15-17H2,1-3H3
charge 0 multiplicity 1
57 atoms
O  1.956559 -0.917822 2.383766
O  -0.535255 -0.131219 -1.045999
N  3.47931 -1.148919 -0.021919
N  0.926292 1.050017 1.693175
N  -2.410147 0.845616 -0.009745
C  4.672977 -1.055116 0.854289
C  3.841644 -1.359616 -1.445287
C  5.5415 -2.323779 0.742965
C  4.681871 -2.642172 -1.615599
C  5.943701 -2.591396 -0.724961
C  2.547899 -0.028537 0.142103
C  1.814571 -0.029366 1.495561
C  0.759469 2.139762 0.757006
C  0.140469 1.111998 2.942796
C  -0.269657 2.112081 -0.22536
C  1.594189 3.27919 0.865369
C  -1.081149 0.849781 -0.450069
C  -0.421576 3.21646 -1.101218
C  1.433163 4.376484 -0.007501
C  0.42296 4.342199 -0.997725
C  -3.285374 -0.289395 -0.217502
C  -3.002932 2.041453 0.636227
C  -2.79815 -1.623363 -0.178922
C  -4.672328 -0.073093 -0.417374
C  -5.079197 -2.500739 -0.552426
C  -3.688916 -2.700856 -0.345503
C  -5.550823 -1.166274 -0.580652
C  -6.018956 -3.677935 -0.742846
H  4.323725 -0.929036 1.892584
H  5.295516 -0.157865 0.581254
H  4.425274 -0.48822 -1.852276
H  2.908414 -1.434485 -2.03443
H  6.439502 -2.209695 1.380894
H  4.95941 -3.181297 1.131104
H  4.06045 -3.511531 -1.326492
H  4.957045 -2.762004 -2.681641
H  6.610428 -1.776912 -1.078908
H  6.514871 -3.535895 -0.807047
H  3.046742 0.969372 0.012079
H  1.766721 -0.091807 -0.640682
H  0.460183 0.26678 3.573568
H  0.323727 2.063668 3.475398
H  -0.942589 1.017074 2.736489
H  2.370393 3.286279 1.638764
H  -1.198283 3.184799 -1.874249
H  2.090979 5.247877 0.07988
H  0.296496 5.18479 -1.685817
H  -3.57502 2.659221 -0.0817
H  -3.680726 1.720235 1.44461
H  -2.208649 2.668518 1.065268
H  -1.734639 -1.811821 -0.028074
H  -5.076813 0.943183 -0.458534
H  -3.292416 -3.722833 -0.308134
H  -6.619084 -0.973638 -0.736166
H  -5.908972 -4.418281 0.07121
H  -5.80976 -4.207447 -1.691985
H  -7.074041 -3.354976 -0.766318
