program: Gaussian 09
title: 000005394
version: EM64L-G09RevD.01
frameworkgroup: C1[X(C6H6N6O2)]
method: RPBEPBE
basis: SDD
operation: Freq
keyword: #pfreq=noraman
keyword: PBEPBE/SDD
title: #p freq=noraman PBEPBE/SDD
converged: NO NO NO NO
title: Mulliken charges:
elementType: O O N N N N N N C C C C C C H H H H H H
charge: -0.222163 -0.232032 -0.246661 -0.246899 -0.108449 0.022106 0.009982 -0.616161 0.066861 0.049180 0.339220 -0.167285 -0.584131 0.160961 0.296417 0.268079 0.260183 0.260183 0.354688 0.335922
chargesum: 0.00000
title: Mulliken charges with hydrogens summed into heavy atoms:
elementType: O O N N N N N N C C C C C C
charge: -0.222163 -0.232032 -0.246661 -0.246899 -0.108449 0.022106 0.009982 0.074449 0.066861 0.049180 0.339220 0.129132 0.204313 0.160961
polarizability: 1.83066303e+02 -9.17194402e+00 1.25178045e+02 1.06321251e-02 7.85121592e-03 5.01130604e+01
1716.lowfreq: -69.4160 -8.3296 -3.6850 0.0007 0.0008 0.0008 5.8417 61.8593 72.9262
frequency: -69.4052 61.8535 72.9218 109.3933 129.0718 216.6944 239.9523 281.0726 285.2116 310.9516 322.2490 446.3972 479.2035 522.9840 526.3369 559.4612 562.9087 641.9597 649.1745 657.3682 663.6511 675.3842 712.7148 779.2783 791.8625 826.8925 847.5676 952.3526 1003.9519 1067.7931 1119.5531 1128.7498 1165.6086 1193.1934 1207.1799 1247.1970 1274.2048 1325.3799 1354.1632 1379.0913 1414.7971 1431.1180 1472.4035 1479.0803 1541.5892 1572.7667 1635.6845 1655.2090 3020.0301 3117.4877 3146.1171 3258.0804 3500.5034 3671.7960
redmass: 1.0346 6.5849 5.9066 6.3236 6.9279 6.0945 9.9918 5.6301 5.2912 4.7565 4.0662 8.4365 6.9775 3.0036 7.0653 5.3861 1.8564 3.2994 1.1133 5.2055 11.2857 8.5014 7.0065 8.2509 7.6580 1.5797 4.6731 8.2240 4.7835 2.0090 3.1754 1.3025 2.2710 2.5889 6.2727 7.1087 6.4811 8.2976 5.8012 4.5847 3.1535 1.3565 1.0415 1.0824 6.5545 1.4598 5.2227 11.0823 1.0329 1.1032 1.1021 1.0997 1.0459 1.1038
irintensity: 0.0049 10.2278 0.6715 3.1663 9.0661 3.1029 3.1675 1.5897 6.1148 3.2075 12.8604 2.8429 18.4861 40.7277 22.8547 2.5446 62.6248 107.6942 78.4981 40.6473 0.4744 41.8810 10.7622 10.1763 62.3271 12.9429 62.5802 17.1896 28.1774 8.4607 0.2713 0.7751 35.9818 0.8337 131.2575 31.1835 10.5791 92.2441 112.5823 2.1118 37.6809 29.8502 21.0120 18.4301 19.2104 250.8886 232.6420 395.1751 25.4215 11.5156 0.3451 5.8351 56.0913 69.8192
temp: 298.150 k
press: 1.00000 atm
elementType: 8 8 7 7 7 7 7 7 6 6 6 6 6 6 1 1 1 1 1 1
symmnumber: 1
zpe: 357130.7 jmol-1
zpe.correction: 0.136024 hartree
zpe.thermalcorrener: 0.147219 hartree
zpe.thermalcorrenthalpy: 0.148163 hartree
zpe.thermalcorrgfe: 0.098395 hartree
zpe.sumelectzpe: -710.159110 hartree
zpe.sumelectthermal: -710.147915 hartree
zpe.sumelectthermalent: -710.146971 hartree
zpe.sumelectthermalfe: -710.196739 hartree
dipole: 1.9062 3.2235 0.0001
dipole: 3.7449
quadrupole: -64.9629 -92.8487 -79.2194
quadrupole: -16.6334 -0.0022 -0.0035
quadrupole: 14.0475 -13.8384 -0.2091 -16.6334 -0.0022 -0.0035
hfenergy: -710.2951335 hartree
pointgroup: C01 [X(C6H6N6O2)]
dipole: 0.7506513 1.2678161 0.0000373 debye
dipolederiv: -0.7861409 -0.2984469 -0.000114 -0.5784589 -0.8855034 -0.0002114 -0.0002778 -0.0002316 -0.3541723 -0.7194148 -0.1425205 -0.0000125 -0.0710945 -0.8941233 -0.0000283 -0.0001603 0.0004106 -0.3474256 -1.2297059 -0.1450328 -0.0001674 -0.3257716 -0.214981 -0.0001617 -0.000262 -0.0000849 0.028598 -0.6657504 0.1032637 -0.0000491 -1.0958016 -0.8207806 -0.0004214 -0.0004844 -0.0001544 -0.12284 -0.3391136 -0.0737285 -0.0000502 0.1293951 -0.31297 0.0000004 -0.0002628 -0.0000534 -0.2467993 -0.4451787 -0.2651625 -0.0001846 -0.2615899 0.0731867 0.000062 -0.0001599 -0.0000509 -0.0837452 0.6922847 0.5001787 0.0003417 0.9451581 0.1728218 0.0002942 0.0005182 0.0002043 -0.1356774 -1.0960678 0.4622921 -0.000444 0.3055964 -0.6049029 0.0001059 -0.0005406 0.0000127 -0.6838841 0.3472751 0.0546768 0.0000443 0.4699961 -0.0901847 0.0000173 -0.000009 -0.0000187 0.1198476 -0.1668378 0.0492454 0.0000268 -0.2388426 0.1151676 0.0001266 -0.0000072 0.0000353 0.0270582 1.2224872 0.2395037 0.0001442 0.790034 1.3660798 0.0003735 0.0004 0.0003115 0.3493514 0.1489917 -0.067976 -0.0000006 0.0141492 0.1375004 0.0000312 0.0000657 0.0001181 -0.0279773 0.4945544 -0.1807494 0.0000233 -0.1121242 0.0913242 -0.0000532 0.000042 -0.0000638 0.18822 1.7333345 -0.2276152 0.0002206 0.0199504 1.2272058 -0.0001715 0.0005601 -0.0002841 0.243332 0.0692997 -0.0328907 -0.0000085 -0.0195063 0.1128104 -0.0000199 0.0000343 -0.0001023 0.1860823 0.0670498 0.0000451 -0.0000171 -0.1096747 0.0199348 -0.0000301 -0.000046 -0.0000173 0.1410409 0.0397975 0.0322973 -0.0107384 0.083149 0.0642846 -0.0884236 0.0533165 -0.0845254 -0.023516 0.0397747 0.0322694 0.0107725 0.083136 0.0642198 0.0884803 -0.0532611 0.0845688 -0.0234873 0.3576073 -0.0048841 0.0001099 -0.0231125 0.2111317 0.0000003 0.0002708 -0.0000921 0.3783688 0.2357533 -0.0347655 0.0001031 -0.0045874 0.1677783 0.0000293 0.0002634 0.0000178 0.3876253 unknown
polarizability: 183.0562892|-9.2034849|125.1880583|0.0106364|0.0078454|50.1130604 unknown
InChI: InChI=1S/C6H6N6O2/c1-11-6(14)12-2-8-3(4(7)13)5(12)9-10-11/h2H,7H2,1H3
charge 0 multiplicity 1
20 atoms
O  2.750402 1.732302 0.000286
O  -3.006557 -1.786807 -0.000182
N  0.572903 0.823994 -0.000402
N  2.399615 -0.612787 -0.00043
N  -1.539431 1.597304 -0.000349
N  0.239918 -1.61195 -0.001185
N  1.538465 -1.789589 -0.001044
N  -3.980702 0.344678 -0.000958
C  -0.283725 -0.326653 -0.000763
C  -1.592544 0.194225 -0.000847
C  1.996674 0.732827 -0.000197
C  -0.238672 1.949091 -0.000341
C  3.833142 -0.962205 -0.000192
C  -2.906909 -0.525761 -0.001107
H  0.160007 2.959388 -0.000057
H  4.416482 -0.030382 0.000062
H  4.069523 -1.5545 -0.898316
H  4.069167 -1.554766 0.897852
H  -3.812762 1.352523 -0.000934
H  -4.924696 -0.036335 -0.000296
