program: Gaussian 09
title: 000041385
version: EM64L-G09RevD.01
frameworkgroup: C1[X(C6H10O4S2)]
method: RPBEPBE
basis: SDD
operation: Freq
keyword: #p
keyword: freq=noraman
keyword: PBEPBE/SDD
title: #p freq=noraman PBEPBE/SDD
converged: YES YES NO NO
title: Mulliken charges:
elementType: S S O O O O C C C C C C H H H H H H H H H H
charge: 0.876855 0.876787 -0.534669 -0.543447 -0.534619 -0.543512 -0.551839 -0.551800 0.055662 0.055977 -0.743737 -0.743689 0.322675 0.314049 0.322834 0.314040 0.273400 0.292047 0.238747 0.238752 0.273471 0.292015
chargesum: 0.00000
title: Mulliken charges with hydrogens summed into heavy atoms:
elementType: S S O O O O C C C C C C
charge: 0.876855 0.876787 -0.534669 -0.543447 -0.534619 -0.543512 0.084885 0.085074 0.055662 0.055977 0.060457 0.060549
polarizability: 1.56688641e+02 -1.08669930e-02 1.29849510e+02 3.75810962e+00 -9.25057382e-04 1.02504726e+02
1716.lowfreq: -19.3464 -12.7908 -0.0014 0.0019 0.0031 2.5189 20.9738 69.6143 125.5646
frequency: 16.2902 69.6071 125.5542 130.4887 134.9885 147.9756 163.6208 197.9819 208.5952 215.5312 232.2982 273.2100 279.0753 280.3656 316.9544 355.5776 358.9054 374.5727 406.8108 469.5342 506.5602 543.0712 567.9282 621.7845 793.7258 797.0670 867.7483 877.5079 894.7677 930.3255 956.9413 1023.7660 1033.5540 1041.9175 1047.2272 1063.1981 1087.8642 1115.4185 1139.8894 1244.7767 1272.4125 1388.2788 1395.7391 1401.8093 1404.4356 1442.9375 1445.1342 1457.8998 1465.6041 1681.2570 2982.4811 2983.1374 3038.5790 3041.9469 3066.2393 3066.4563 3105.9471 3111.4300 3128.6258 3133.1142
redmass: 5.7956 3.8970 2.3253 1.1304 1.4146 6.6475 6.1649 5.2396 4.0111 4.5703 8.5110 5.8589 2.6536 3.4398 5.8810 5.3069 4.1039 5.3951 9.4825 4.3264 4.4936 4.1637 8.5455 3.7719 12.2206 11.5494 3.0637 1.6646 2.4842 11.1654 3.8061 1.3774 1.8609 1.5051 1.6122 1.5186 1.1636 5.4080 1.4146 1.2607 1.2877 1.2014 1.1956 1.0825 1.0980 1.0459 1.0397 1.0448 1.0605 8.1707 1.0359 1.0362 1.0541 1.0592 1.0983 1.0977 1.0994 1.0980 1.1100 1.1100
irintensity: 12.7636 0.0160 1.6847 0.1539 1.1289 2.6974 0.1303 5.7377 2.0188 0.8340 32.4093 3.1418 4.1057 0.4484 24.7518 18.9693 1.9321 26.7963 16.5298 6.8511 1.5052 6.9122 62.7414 4.3089 130.8930 0.0161 2.3348 74.5667 5.4758 145.0283 16.6754 2.0123 1.2322 2.3576 8.1601 12.4512 13.8075 4.2152 5.7348 3.2114 0.0050 13.9568 25.4961 32.5220 5.3531 0.1566 44.5859 20.7605 24.8159 8.3951 0.4155 6.2304 2.3579 0.1492 0.0124 2.9138 1.9613 7.9115 1.0398 6.4311
temp: 298.150 k
press: 1.00000 atm
elementType: 16 16 8 8 8 8 6 6 6 6 6 6 1 1 1 1 1 1 1 1 1 1
symmnumber: 1
zpe: 406290.3 jmol-1
zpe.correction: 0.154748 hartree
zpe.thermalcorrener: 0.169559 hartree
zpe.thermalcorrenthalpy: 0.170503 hartree
zpe.thermalcorrgfe: 0.112721 hartree
zpe.sumelectzpe: -1330.351889 hartree
zpe.sumelectthermal: -1330.337078 hartree
zpe.sumelectthermalent: -1330.336134 hartree
zpe.sumelectthermalfe: -1330.393916 hartree
dipole: -0.0029 1.5496 -0.0103
dipole: 1.5496
quadrupole: -115.2936 -65.7756 -99.3498
quadrupole: -0.0056 2.3978 0.0251
quadrupole: -21.8206 27.6974 -5.8768 -0.0056 2.3978 0.0251
hfenergy: -1330.5066369 hartree
pointgroup: C01 [X(C6H10O4S2)]
dipole: -0.0010658 -0.6096505 0.0039464 debye
dipolederiv: 1.4309049 -0.0867161 0.0228099 -0.3434859 1.0109781 0.014248 -0.0053133 -0.0532353 1.1485875 1.4312723 0.086833 0.0226072 0.3430781 1.0108929 -0.0143649 -0.0054938 0.0527166 1.1486691 -0.6981582 0.0105381 0.0523043 0.0547723 -0.5207845 -0.0092199 0.1961694 0.0156496 -0.5512721 -0.5950591 0.026322 -0.003066 0.1011349 -0.5211453 0.0309523 -0.1676474 0.0543568 -0.6171953 -0.6976715 -0.0108444 0.0524333 -0.0548737 -0.520685 0.0092012 0.1963557 -0.0153927 -0.5516741 -0.5955678 -0.0263649 -0.0032462 -0.1008511 -0.5210691 -0.0306522 -0.1679319 -0.0539065 -0.6171567 -0.1300053 0.0801782 -0.0117611 0.1545235 -0.124058 -0.0016722 -0.0707571 0.0372474 -0.1364061 -0.1301216 -0.0804389 -0.0118459 -0.1541367 -0.1236508 0.001658 -0.0712182 -0.0373422 -0.1365781 -0.0515786 0.2343137 -0.0142379 -0.0543639 0.0741907 -0.0234814 0.019192 -0.040341 -0.2370777 -0.0512681 -0.2341953 -0.0143392 0.0545414 0.0744969 0.0235512 0.018757 0.0405634 -0.2372024 -0.2615169 -0.0202988 0.0418734 -0.0136547 -0.1916577 0.0083212 0.0206224 0.0372241 0.0423785 -0.2615041 0.0203513 0.0416305 0.0135274 -0.1917953 -0.0083963 0.0208827 -0.0372471 0.0421766 0.0780157 -0.0592664 -0.0526057 -0.0732426 0.0706909 0.0122827 0.0125551 0.0249546 0.0501205 0.0197916 0.0415337 0.0029361 0.0244353 0.0433717 0.0015295 0.0254478 -0.027466 0.1197191 0.0781738 0.0595929 -0.0523703 0.0732981 0.0708721 -0.0121843 0.0129521 -0.0248453 0.0502433 0.0197548 -0.0414328 0.0027349 -0.0245414 0.0432828 -0.0017403 0.0253068 0.0271375 0.1198135 0.066187 -0.0369568 -0.0537011 -0.0475832 0.093407 0.0313535 -0.0656519 -0.0074124 -0.0045201 0.0669344 -0.0282558 0.0504359 -0.0134023 0.1264924 -0.0588417 0.0524743 -0.0265443 0.057818 0.0741593 0.082419 -0.0348376 0.0696787 -0.0618979 0.0276798 -0.016782 0.0060365 0.1280204 0.0741445 -0.0824434 -0.0344835 -0.0697865 -0.0618962 -0.0274693 -0.0166484 -0.0058615 0.1281989 0.0661092 0.0368544 -0.0537722 0.0473425 0.093676 -0.0315986 -0.0657801 0.0072134 -0.0042098 0.0670039 0.0282772 0.0505013 0.0135897 0.1262883 0.0588437 0.0525088 0.0264942 0.0575471 unknown
polarizability: 156.4913678|0.0104012|129.8495078|-4.9773039|0.0042996|102.7020014 unknown
InChI: InChI=1S/C6H10O4S2/c1-5-6(2)12(9,10)4-3-11(5,7)8/h3-4H2,1-2H3
charge 0 multiplicity 1
22 atoms
S  -1.757391 0.475298 -0.01153
S  1.757413 0.474863 0.011986
O  -2.923599 0.314471 1.11598
O  -2.138195 0.735906 -1.581225
O  2.921161 0.31559 -1.118247
O  2.141727 0.731644 1.581466
C  -0.576293 1.932745 0.494341
C  0.576472 1.934451 -0.488144
C  -0.670794 -1.171971 0.046578
C  0.669968 -1.171995 -0.046499
C  -1.622347 -2.333021 0.120493
C  1.621433 -2.333119 -0.120489
H  -0.281625 1.743235 1.539833
H  -1.225896 2.819394 0.412036
H  0.281644 1.748905 -1.534305
H  1.22635 2.820574 -0.402464
H  -2.18525 -2.437684 -0.826062
H  -2.358682 -2.159287 0.927481
H  -1.088919 -3.275398 0.323457
H  1.087729 -3.275772 -0.321422
H  2.185827 -2.436532 0.825314
H  2.356465 -2.160398 -0.928878
