program: Gaussian 09
title: 000041369
version: EM64L-G09RevD.01
frameworkgroup: C1[X(C10H14FOP)]
method: RPBEPBE
basis: SDD
operation: Freq
keyword: #p
keyword: freq=noraman
keyword: PBEPBE/SDD
title: #p freq=noraman PBEPBE/SDD
converged: NO YES NO NO
title: Mulliken charges:
elementType: P F O C C C C C C C C C C H H H H H H H H H H H H H H
charge: 1.213838 -0.409527 -0.620250 -0.128480 -0.676788 -0.655127 -0.681763 -0.219360 -0.241061 -0.294895 -0.225566 -0.210789 -0.218675 0.250514 0.224156 0.229106 0.240833 0.253288 0.211322 0.232249 0.221900 0.244643 0.267299 0.279986 0.237909 0.238743 0.236495
chargesum: 0.00000
title: Mulliken charges with hydrogens summed into heavy atoms:
elementType: P F O C C C C C C C C C C
charge: 1.213838 -0.409527 -0.620250 -0.128480 0.026988 0.050316 0.017029 -0.219360 0.026238 -0.014909 0.012344 0.027954 0.017820
polarizability: 1.67825065e+02 -3.49178965e+00 1.27931484e+02 -7.42525295e+00 -7.68909692e+00 9.32502587e+01
1716.lowfreq: -15.1298 -0.0017 -0.0013 -0.0012 6.9366 10.3259 41.9202 46.6233 72.9468
frequency: 41.5459 46.5040 72.9240 125.2635 162.5551 176.4887 194.3570 236.0040 237.7725 251.3557 256.7372 268.6685 276.8488 333.6659 356.2316 386.5891 399.3453 409.8724 466.7843 492.6265 570.0355 609.8839 647.2904 697.3670 703.6883 765.5315 797.1756 864.2156 939.2863 941.8979 942.8222 963.9457 986.0562 987.3395 1006.2927 1014.3154 1019.4608 1021.5954 1034.9522 1082.2167 1095.4719 1176.0548 1188.9722 1192.8595 1222.4454 1228.0559 1313.5832 1379.0070 1379.8166 1382.8830 1406.8734 1426.6569 1454.0432 1465.3740 1468.1207 1471.9398 1478.2719 1479.2899 1498.3794 1586.7797 1595.9086 2975.8578 2979.7198 2982.7177 3069.6215 3072.1992 3080.5607 3084.9056 3092.4971 3095.4709 3131.8905 3140.3352 3150.3194 3160.9775 3171.6554
redmass: 3.5702 3.3807 4.3035 5.7379 5.4790 3.7846 1.0577 7.5114 2.7605 1.5309 2.9011 1.4046 1.7329 4.0457 3.5865 2.9397 2.8106 3.2640 4.1907 3.3735 5.1827 6.5081 12.7486 7.1670 1.9374 1.6620 3.0365 1.2425 1.3770 1.5976 1.5665 1.2075 1.9996 2.6108 1.3315 1.9491 2.2020 1.6735 3.9736 1.6964 2.9354 1.0555 1.7175 1.2614 2.8382 3.0028 1.3157 1.3375 3.8577 1.2456 1.1911 2.1111 1.0456 1.9783 1.0484 1.0602 1.0493 1.0499 1.0544 6.0368 5.8288 1.0350 1.0355 1.0357 1.0996 1.0988 1.0990 1.1005 1.1002 1.1003 1.0854 1.0886 1.0929 1.0966 1.1014
irintensity: 0.1839 1.0294 1.3265 1.4242 0.4800 5.3898 0.3951 11.4466 7.4340 1.9899 9.4365 0.3058 2.4656 0.2621 3.5716 5.8493 0.0280 1.0901 47.1999 16.2953 66.0412 3.1762 91.2610 32.9817 70.3131 34.4358 10.7195 0.1136 1.8392 2.1431 2.6002 0.1265 1.2129 1.4670 0.2479 9.1834 7.7014 4.8881 57.6814 3.0643 55.2212 0.0913 42.9225 3.6595 2.2934 1.9066 2.7133 17.9672 6.6304 23.7977 14.2319 19.0493 0.4946 7.4937 1.3756 1.7269 13.6041 14.9819 30.4775 0.2076 1.1734 18.0963 20.3584 30.5131 0.5787 46.1795 27.4416 11.1445 13.6757 18.8258 0.2471 3.7335 7.7054 16.5395 20.6013
temp: 298.150 k
press: 1.00000 atm
elementType: 15 9 8 6 6 6 6 6 6 6 6 6 6 1 1 1 1 1 1 1 1 1 1 1 1 1 1
symmnumber: 1
zpe: 567430.8 jmol-1
zpe.correction: 0.216123 hartree
zpe.thermalcorrener: 0.230526 hartree
zpe.thermalcorrenthalpy: 0.231470 hartree
zpe.thermalcorrgfe: 0.175054 hartree
zpe.sumelectzpe: -904.781086 hartree
zpe.sumelectthermal: -904.766683 hartree
zpe.sumelectthermalent: -904.765739 hartree
zpe.sumelectthermalfe: -904.822155 hartree
dipole: -1.8183 2.9476 4.1383
dipole: 5.3963
quadrupole: -71.7534 -87.5875 -91.8969
quadrupole: 3.3477 3.1414 -5.0134
quadrupole: 11.9925 -3.8416 -8.1509 3.3477 3.1414 -5.0134
hfenergy: -904.9972087 hartree
pointgroup: C01 [X(C10H14F1O1P1)]
dipole: 0.8045884 -0.725409 -1.8258721 debye
polarizability: 168.4182883|-2.2761725|110.2240234|-4.2494798|-19.2272062|110.364496 unknown
InChI: InChI=1S/C10H14FOP/c1-10(2,3)13(11,12)9-7-5-4-6-8-9/h4-8H,1-3H3
charge 0 multiplicity 1
27 atoms
P  -0.949784 0.205217 0.74418
F  -1.208531 1.947315 0.563993
O  -1.302009 -0.360954 2.192251
C  -2.097568 -0.427687 -0.654305
C  -1.872754 -1.957845 -0.747318
C  -3.546103 -0.107732 -0.208634
C  -1.752023 0.272889 -1.986385
C  0.851494 0.100407 0.311738
C  1.456521 1.012407 -0.585701
C  1.615432 -0.913494 0.938852
C  2.834797 0.892412 -0.870934
C  2.992344 -1.028526 0.645104
C  3.600368 -0.129994 -0.262375
H  -2.100487 -2.457636 0.211112
H  -2.547882 -2.371619 -1.519555
H  -0.835061 -2.206528 -1.037943
H  -3.719665 0.981425 -0.155592
H  -3.764951 -0.54326 0.782309
H  -4.25033 -0.538065 -0.945246
H  -0.725315 0.041263 -2.323229
H  -2.449921 -0.084328 -2.76702
H  -1.860859 1.368595 -1.905926
H  0.868758 1.822423 -1.028941
H  1.138678 -1.58284 1.663621
H  3.311106 1.599755 -1.558161
H  3.588654 -1.80957 1.128555
H  4.669491 -0.218232 -0.485349
