program: Gaussian 09
title: 000005419
version: EM64L-G09RevD.01
frameworkgroup: C1[X(C13H16N2)]
method: RPBEPBE
basis: SDD
operation: Freq
keyword: #pfreq=noraman
keyword: PBEPBE/SDD
title: #p freq=noraman PBEPBE/SDD
converged: YES YES NO NO
title: Mulliken charges:
elementType: N N C C C C C C C C C C C C C H H H H H H H H H H H H H H H H
charge: -0.451242 -0.120705 -0.278969 -0.459721 -0.434566 0.265865 -0.547227 0.277006 0.201158 -0.428653 -0.385859 -0.482313 -0.385340 -0.256451 -0.248773 0.246420 0.197815 0.255182 0.205603 0.227083 0.222585 0.220700 0.326147 0.222356 0.218179 0.257941 0.223729 0.222348 0.233198 0.229271 0.227233
chargesum: 0.00000
title: Mulliken charges with hydrogens summed into heavy atoms:
elementType: N N C C C C C C C C C C C C C
charge: -0.125096 -0.120705 -0.032549 -0.006725 -0.001880 0.265865 -0.103942 0.277006 0.201158 -0.170712 0.054677 -0.036236 -0.152142 -0.027181 -0.021540
polarizability: 1.71830442e+02 -1.23171363e+01 1.50487545e+02 -1.12571205e+01 -5.62387771e+00 1.09246238e+02
1716.lowfreq: -10.8212 -7.0499 -0.0008 -0.0007 -0.0006 11.9964 23.7991 60.8300 78.3008
frequency: 21.6047 60.7562 78.2765 88.8238 144.5539 170.4676 227.1162 273.8561 292.1550 327.0353 367.4768 420.8502 428.8359 460.0976 478.1028 534.2472 571.1707 592.8867 620.9761 705.5294 723.2258 733.1293 753.0371 791.1578 814.6772 826.3094 859.2793 877.9932 888.9861 892.4188 934.4579 938.4065 957.5439 981.2757 988.0889 1005.0824 1035.5836 1044.4235 1068.0316 1079.4335 1101.9565 1113.1343 1149.5183 1158.6292 1166.5155 1174.7978 1198.2359 1209.0461 1212.2237 1231.7518 1235.2522 1257.0334 1270.9267 1277.6505 1300.8129 1313.1422 1336.5088 1350.5017 1355.6428 1378.4334 1436.2329 1437.1594 1451.3201 1462.3412 1469.7782 1475.9674 1487.1630 1503.8719 1576.7797 1588.4674 1609.8583 2956.2107 2966.4511 2972.0159 2991.5972 2995.5078 2997.1446 3016.2009 3023.9738 3052.4158 3055.4059 3077.7277 3109.3218 3113.3776 3135.5118 3158.0415 3589.2525
redmass: 4.3543 3.7128 3.9122 2.1148 2.9451 2.7160 3.6679 2.9749 4.3099 2.5181 3.3275 1.2263 2.7390 3.4596 3.7299 3.7972 3.6706 2.7003 4.4084 3.2906 4.2598 4.3826 1.4228 2.9105 2.8252 1.3120 1.7581 1.9031 1.6589 4.0287 2.8145 4.3725 1.4061 3.3310 1.3165 2.4304 2.5411 3.0437 1.9358 1.6792 1.8041 1.8035 1.2691 1.2781 1.1458 1.0741 2.0022 1.3622 1.4603 1.5983 1.5489 1.3546 1.4419 1.3443 1.4863 1.5537 1.5406 1.3938 1.5916 5.7670 2.2194 2.2681 1.1367 1.0952 1.1052 1.0887 2.3465 1.1265 6.7936 6.7229 6.3057 1.0637 1.0615 1.0800 1.0660 1.0669 1.0658 1.0923 1.0982 1.1017 1.1057 1.0983 1.0865 1.0892 1.0924 1.1004 1.0798
irintensity: 3.1695 0.3907 0.4877 1.2741 2.1780 0.7310 13.6614 11.3579 3.7050 0.3767 2.2658 96.4234 5.1392 1.4247 2.4523 0.8955 6.6916 0.1211 1.0862 0.5252 1.6304 1.3814 55.0223 22.2146 7.4548 2.0012 2.7027 3.4232 8.5108 4.5324 6.0770 16.5218 3.8798 5.8268 0.1576 10.2186 5.5087 2.2257 5.7393 1.7046 0.1601 3.9577 2.1505 0.9950 2.4077 0.4166 0.8608 1.7529 1.7120 18.0969 2.9046 1.6630 53.3913 23.7362 2.9906 1.5758 0.4050 3.4162 0.0718 1.4576 63.2725 30.2746 7.8285 24.4407 0.5886 9.0674 23.1623 11.6307 131.7172 2.0032 1.4544 28.7776 68.9471 10.7593 20.6525 54.1109 65.4629 37.4397 40.3606 61.5229 50.6739 14.1977 15.2060 2.8758 26.0954 32.6999 41.0643
temp: 298.150 k
press: 1.00000 atm
elementType: 7 7 6 6 6 6 6 6 6 6 6 6 6 6 6 1 1 1 1 1 1 1 1 1 1 1 1 1 1 1 1
symmnumber: 1
zpe: 691191.3 jmol-1
zpe.correction: 0.263261 hartree
zpe.thermalcorrener: 0.276080 hartree
zpe.thermalcorrenthalpy: 0.277024 hartree
zpe.thermalcorrgfe: 0.222860 hartree
zpe.sumelectzpe: -613.382661 hartree
zpe.sumelectthermal: -613.369842 hartree
zpe.sumelectthermalent: -613.368898 hartree
zpe.sumelectthermalfe: -613.423062 hartree
dipole: 1.3608 -1.6958 -1.5229
dipole: 2.6545
quadrupole: -89.2152 -83.8726 -88.0602
quadrupole: 5.7576 2.0150 -1.4042
quadrupole: -2.1659 3.1767 -1.0109 5.7576 2.0150 -1.4042
hfenergy: -613.6459221 hartree
pointgroup: C01 [X(C13H16N2)]
dipole: 0.5018638 0.8362249 0.3736029 debye
polarizability: 170.1514603|15.1711888|148.9445184|2.8491264|-15.2546279|112.468247 unknown
InChI: InChI=1S/C13H16N2/c1-2-6-11-10(4-1)5-3-7-12(11)13-14-8-9-15-13/h1-2,4,6,12,14H,3,5,7-9H2
charge 0 multiplicity 1
31 atoms
N  -1.814343 1.102315 0.152757
N  -2.903169 -0.91283 -0.036959
C  -0.57412 -0.830239 -0.972539
C  -0.389446 -2.310282 -0.552739
C  0.19128 -2.39008 0.874339
C  0.701396 -0.007856 -0.747616
C  1.59678 -1.752909 0.929981
C  1.701798 -0.428753 0.174933
C  -1.793355 -0.232876 -0.258953
C  0.895941 1.194088 -1.479534
C  -3.083011 1.390776 0.857429
C  -3.86685 0.042485 0.614818
C  2.851015 0.384245 0.355816
C  2.044673 1.992017 -1.293923
C  3.0280 1.585977 -0.361125
H  -0.814318 -0.799332 -2.05512
H  0.296216 -2.810929 -1.265126
H  -1.370642 -2.811517 -0.599539
H  0.24708 -3.442781 1.20877
H  -0.497074 -1.869669 1.567903
H  2.329409 -2.458553 0.484167
H  1.915785 -1.60787 1.980691
H  -0.985387 1.692546 0.192358
H  -3.602177 2.265049 0.423914
H  -2.91097 1.587182 1.934766
H  0.138052 1.496062 -2.213816
H  -4.246855 -0.394317 1.555344
H  -4.732586 0.193645 -0.056981
H  3.620492 0.06098 1.068961
H  2.175442 2.913035 -1.872891
H  3.925144 2.194991 -0.202887
