program: Gaussian 09
title: 000041370
version: EM64L-G09RevD.01
frameworkgroup: C1[X(C13H10N4)]
method: RPBEPBE
basis: SDD
operation: Freq
keyword: #pfreq=noraman
keyword: PBEPBE/SDD
title: #p freq=noraman PBEPBE/SDD
converged: YES YES NO NO
title: Mulliken charges:
elementType: N N N N C C C C C C C C C C C C C H H H H H H H H H H
charge: -0.006380 -0.053558 -0.069126 0.005294 -0.637028 0.440166 0.019935 0.144918 -0.399701 -0.365858 0.113047 -0.223399 -0.223288 -0.240101 -0.408968 -0.239645 -0.308066 0.240796 0.233196 0.235712 0.261808 0.226864 0.227546 0.263661 0.276475 0.229475 0.256225
chargesum: 0.00000
title: Mulliken charges with hydrogens summed into heavy atoms:
elementType: N N N N C C C C C C C C C C C C C
charge: -0.006380 -0.053558 -0.069126 0.005294 -0.163036 0.440166 0.019935 0.144918 -0.163989 -0.104051 0.113047 0.003464 0.004259 0.023560 -0.132493 -0.010170 -0.051841
polarizability: 2.28571656e+02 -3.39189300e+00 1.58209606e+02 6.20144485e+00 7.45645762e+00 1.09580875e+02
1716.lowfreq: -12.2225 -7.0066 -0.0005 -0.0004 0.0006 4.4972 14.6306 21.9087 40.3076
frequency: 13.5482 21.8656 40.3046 101.5119 162.9708 197.1140 216.0517 275.5759 332.2923 387.2963 403.4588 422.5344 444.5743 459.7373 491.3101 501.7278 522.9567 596.8033 616.2958 625.5504 697.4529 702.8679 730.8184 757.7576 779.0565 801.8694 830.5813 838.2446 844.8483 855.4273 898.6489 922.7028 929.5240 951.7110 973.5232 979.3328 989.6637 997.2981 1007.8370 1026.6934 1054.7731 1085.0662 1148.0771 1168.0519 1172.9015 1188.8643 1198.2562 1210.8230 1223.2828 1275.7076 1288.6625 1310.6409 1331.1585 1354.6518 1382.7790 1413.1743 1433.9070 1440.3326 1449.8709 1470.0556 1482.8687 1513.4235 1571.7057 1594.2866 1610.6334 3023.8008 3095.9756 3122.0546 3127.8089 3139.4032 3145.3536 3149.1661 3154.8306 3164.6156 3178.6910
redmass: 3.9118 6.5048 5.1750 5.8668 9.6486 4.8369 4.8408 4.6946 2.3411 7.3190 2.8302 3.9175 4.0071 3.5585 5.4304 8.8038 5.5342 5.1797 6.3720 9.0797 5.1702 2.1417 2.1568 5.7928 3.3678 3.6515 2.1844 4.3931 2.0500 1.2539 5.5315 1.6303 1.5658 2.2871 1.4265 1.3935 5.7716 1.3365 2.2174 2.2690 4.3807 1.7960 1.7586 2.9097 1.0640 1.1553 2.6516 2.0883 2.5469 2.5038 1.3897 1.6420 1.2856 9.0574 7.9757 3.4406 2.3091 2.1372 1.1998 5.4691 2.2745 6.6972 7.0043 6.0955 6.0467 1.0599 1.1025 1.0852 1.0876 1.0923 1.0921 1.0966 1.0892 1.1017 1.0989
irintensity: 0.0587 0.1980 0.4782 2.2793 4.5501 1.1657 1.8186 2.0418 0.9641 10.2706 0.1307 1.6451 2.8229 0.7160 4.7693 2.3452 5.2741 9.8471 0.3897 5.0322 15.7281 29.8686 71.1092 17.1290 4.6155 7.4579 35.7806 6.9448 24.2899 0.4315 11.1720 7.4831 3.0301 2.0582 0.1466 0.5696 1.0942 0.4582 7.0070 8.6162 20.7266 3.1606 10.3050 4.3730 0.2390 2.2900 3.4575 11.3820 37.6263 17.1881 11.5320 14.0582 0.5906 9.0576 0.9552 7.4940 44.0780 9.7465 18.2454 110.2200 10.9649 6.1288 11.7156 1.4996 9.4895 13.0538 3.1867 3.0983 0.5630 17.1793 6.0202 31.0014 4.8445 24.0990 15.4286
temp: 298.150 k
press: 1.00000 atm
elementType: 7 7 7 7 6 6 6 6 6 6 6 6 6 6 6 6 6 1 1 1 1 1 1 1 1 1 1
symmnumber: 1
zpe: 532487.7 jmol-1
zpe.correction: 0.202814 hartree
zpe.thermalcorrener: 0.215722 hartree
zpe.thermalcorrenthalpy: 0.216666 hartree
zpe.thermalcorrgfe: 0.160254 hartree
zpe.sumelectzpe: -719.172918 hartree
zpe.sumelectthermal: -719.160011 hartree
zpe.sumelectthermalent: -719.159066 hartree
zpe.sumelectthermalfe: -719.215478 hartree
dipole: 0.1771 0.2955 -0.2196
dipole: 0.4085
quadrupole: -92.1443 -101.4641 -95.0205
quadrupole: 8.0996 -1.3756 3.5921
quadrupole: 4.0653 -5.2545 1.1891 8.0996 -1.3756 3.5921
hfenergy: -719.3757321 hartree
pointgroup: C01 [X(C13H10N4)]
dipole: 0.0678092 0.1357038 -0.0530766 debye
polarizability: 228.646033|-3.7411187|151.1189627|5.4987444|18.6422344|116.5971408 unknown
InChI: InChI=1S/C13H10N4/c1-2-4-10(5-3-1)8-13-15-12-9-14-7-6-11(12)16-17-13/h1-7,9H,8H2
charge 0 multiplicity 1
27 atoms
N  -0.825232 0.589334 1.068793
N  -0.281957 -1.691345 0.314044
N  -1.445399 -1.825683 -0.3436
N  -4.172965 1.429752 -0.258743
C  1.358303 -0.418291 1.654066
C  2.454376 -0.04909 0.646773
C  -0.001064 -0.475359 0.994749
C  -2.029148 0.46174 0.394299
C  3.023715 1.248116 0.648685
C  2.900859 -0.998463 -0.308251
C  -2.342426 -0.743662 -0.323357
C  4.031632 1.590534 -0.282196
C  3.907248 -0.656362 -1.238622
C  -3.588197 -0.839107 -1.010088
C  -2.99679 1.52124 0.389995
C  4.477089 0.638664 -1.227798
C  -4.454778 0.256053 -0.949433
H  1.570924 -1.410104 2.090574
H  1.315963 0.328825 2.46318
H  2.678958 1.989927 1.378996
H  2.450775 -1.997789 -0.322357
H  4.468089 2.595613 -0.267583
H  4.247029 -1.398658 -1.969659
H  -3.835737 -1.752107 -1.559152
H  -2.778317 2.448242 0.931325
H  5.259387 0.902552 -1.948255
H  -5.424136 0.240029 -1.457083
