program: Gaussian 09
title: 000005485
version: EM64L-G09RevD.01
frameworkgroup: C1[X(C19H24NS2)]
method: RPBEPBE
basis: SDD
operation: Freq
keyword: #p
keyword: freq=noraman
keyword: PBEPBE/SDD
title: #p freq=noraman PBEPBE/SDD
converged: NO YES NO NO
title: Mulliken charges:
elementType: S S N C C C C C C C C C C C C C C C C C C C H H H H H H H H H H H H H H H H H H H H H H H H
charge: 0.242302 0.207047 -0.129783 0.009826 -0.345974 -0.576202 -0.464728 -0.483370 -0.439307 -0.422122 -0.606933 -0.579243 0.351120 0.413940 -0.351911 -0.318897 -0.275586 -0.259538 -0.131338 -0.128439 -0.497114 -0.487161 0.255148 0.255222 0.282241 0.289954 0.268023 0.246906 0.236969 0.254097 0.248122 0.232407 0.253741 0.226201 0.253653 0.226360 0.288325 0.261831 0.260309 0.270237 0.284315 0.283554 0.265061 0.264771 0.283658 0.282304
chargesum: 1.00000
title: Mulliken charges with hydrogens summed into heavy atoms:
elementType: S S N C C C C C C C C C C C C C C C C C C C
charge: 0.242302 0.207047 -0.129783 0.264974 0.191490 -0.018225 0.019147 0.018848 0.046842 0.057731 -0.092248 0.213134 0.351120 0.413940 -0.351911 -0.318897 0.008729 0.024016 0.133723 0.136333 -0.213456 -0.204857
polarizability: 2.91377300e+02 3.64132037e+00 2.70094408e+02 -2.48937775e+01 8.36574737e+00 1.77196309e+02
1716.lowfreq: -13.5684 -3.5000 -0.0013 -0.0007 0.0008 10.2329 23.5049 34.0414 39.7462
frequency: 23.2645 33.8686 39.5239 65.3129 77.7867 87.1404 124.8897 141.4360 154.4533 191.2610 213.4384 216.7036 234.6328 259.2355 276.2672 287.7653 295.2263 325.9419 350.5138 386.2206 411.0413 423.2537 437.7022 452.3003 467.7206 479.6489 498.6892 529.6029 551.0939 565.1692 580.6182 596.9271 607.5765 639.9457 659.3825 673.9221 689.5948 705.9669 714.8419 719.7254 747.3302 780.7698 800.9982 811.3666 819.9164 831.6816 834.3817 852.9857 855.6958 867.4250 881.5719 893.3745 928.4454 928.9160 932.8325 943.8217 975.8964 995.5874 1006.4889 1022.2929 1038.4628 1047.9189 1052.4103 1056.3965 1080.8461 1092.1035 1110.0111 1115.8420 1126.2624 1142.5351 1145.8992 1172.5334 1192.5930 1194.1398 1208.5376 1221.7969 1233.9966 1249.8242 1264.0230 1269.7487 1279.7750 1300.1410 1306.0804 1324.8381 1325.7977 1337.1082 1340.9746 1343.1232 1350.6139 1354.9560 1363.0458 1364.4452 1369.0777 1428.5179 1445.5086 1459.4079 1460.8458 1461.4373 1465.5886 1466.6501 1469.0418 1480.5417 1486.6925 1489.5997 1496.9746 1524.6099 1535.5653 1598.6683 2946.7749 2993.2988 2996.5948 3002.4090 3004.5131 3008.6059 3011.2580 3025.1528 3027.9096 3057.9362 3058.3407 3068.4479 3074.4144 3093.3649 3094.7135 3096.5166 3131.0783 3163.0308 3176.0136 3178.4954 3194.1331 3195.8353 3239.2151 3239.7991
redmass: 6.2821 4.9364 4.3622 5.8789 4.1957 5.0099 5.0748 3.4662 1.4031 3.4120 1.8342 4.6156 4.8316 6.3850 3.2865 2.6711 3.0421 2.3666 2.1979 2.3632 2.7132 2.4463 3.7404 3.5676 3.6637 2.9481 3.7697 3.0033 3.4684 3.0798 3.7705 6.0825 5.0715 4.7398 3.5115 4.1874 7.0607 4.0282 1.1846 1.1841 4.9752 1.8638 3.1214 3.4186 2.7218 3.3680 3.4270 1.6954 1.4011 1.7571 2.0868 1.6199 1.6365 1.6111 1.5172 2.3399 1.9172 2.0470 2.5435 1.9507 1.9494 2.2129 1.8426 1.7233 1.3918 1.1058 1.4399 1.4241 1.6341 1.7282 1.6755 1.4970 1.7614 2.0250 1.3934 1.4232 1.6119 1.5514 1.2720 1.2927 1.3197 1.5207 2.0441 1.6410 1.4768 2.4687 1.6354 1.3571 1.4717 1.4319 1.3806 1.3869 1.4561 1.1654 1.0937 1.1716 3.6975 3.8210 1.3217 1.0841 1.0762 1.0786 1.0754 1.0822 1.0642 5.0906 5.6183 8.2233 1.0707 1.0654 1.0757 1.0654 1.0630 1.0648 1.0681 1.0574 1.0389 1.0984 1.0984 1.1003 1.1020 1.0937 1.0992 1.1045 1.1044 1.1015 1.0913 1.0911 1.0968 1.0968 1.1008 1.1010
irintensity: 0.5454 1.0576 0.1767 0.7630 0.6757 0.1720 3.9767 2.2896 0.0732 0.4677 0.6949 0.3588 1.3689 0.0696 0.1888 0.4312 0.1582 0.3287 0.4499 0.1078 1.5547 1.3014 1.3152 2.6529 2.7911 2.2198 0.7118 1.1720 1.7906 4.5506 3.5806 2.9231 3.5915 1.4039 2.7049 3.2269 0.0568 1.8625 122.4336 66.6118 31.8134 3.5499 88.9922 0.7710 7.5776 21.5065 17.5790 0.2755 12.8120 0.6527 11.9438 10.1737 4.8605 5.6306 3.2247 22.0860 1.0116 6.5747 50.4270 7.3552 9.0553 6.5582 3.3177 6.3806 7.2311 0.9671 2.1755 0.5378 1.2722 2.4294 3.1032 3.7052 18.5731 10.1828 1.7881 3.4471 27.3434 11.4050 29.3242 3.1695 3.1417 14.9689 34.4009 1.2268 10.6008 5.3116 7.6974 1.1879 2.6103 1.1832 2.2715 2.3064 4.8769 17.5618 12.1433 9.1843 27.5649 27.7495 14.0052 36.3771 37.9117 9.8960 17.8345 32.2851 4.1332 0.9826 7.3599 61.8782 23.3215 24.2850 6.7315 11.8887 12.0459 22.5307 30.7013 5.2874 10.9918 12.7703 7.6175 20.4975 37.8906 3.1265 3.3290 12.9236 4.7627 6.7870 3.4611 1.5362 1.2070 1.0948 2.4892 2.0578
temp: 298.150 k
press: 1.00000 atm
elementType: 16 16 7 6 6 6 6 6 6 6 6 6 6 6 6 6 6 6 6 6 6 6 1 1 1 1 1 1 1 1 1 1 1 1 1 1 1 1 1 1 1 1 1 1 1 1
symmnumber: 1
zpe: 1014581.3 jmol-1
zpe.correction: 0.386434 hartree
zpe.thermalcorrener: 0.406769 hartree
zpe.thermalcorrenthalpy: 0.407713 hartree
zpe.thermalcorrgfe: 0.336973 hartree
zpe.sumelectzpe: -1587.396128 hartree
zpe.sumelectthermal: -1587.375793 hartree
zpe.sumelectthermalent: -1587.374849 hartree
zpe.sumelectthermalfe: -1587.445589 hartree
dipole: 6.6650 -2.0859 0.7038
dipole: 7.0191
quadrupole: -86.4100 -113.8550 -134.8557
quadrupole: -6.0847 -5.3715 -0.1810
quadrupole: 25.2969 -2.1481 -23.1488 -6.0847 -5.3715 -0.1810
hfenergy: -1587.7825616 hartree
pointgroup: C01 [X(C19H24N1S2)]
dipole: -2.7236842 0.4556526 -0.0025852 debye
polarizability: 286.419688|14.7597131|263.5427648|29.6361445|-26.1057986|188.7055646 unknown
InChI: InChI=1S/C19H24NS2/c1-20-11-3-2-6-16(20)10-9-15(14-20)19(17-7-4-12-21-17)18-8-5-13-22-18/h4-5,7-8,12-13,16H,2-3,6,9-11,14H2,1H3
charge 1 multiplicity 1
46 atoms
S  1.600491 2.641487 -1.565776
S  1.368968 -2.440823 1.058663
N  -2.503141 0.502009 -0.537994
C  -3.015302 -0.918828 -0.966067
C  -2.28984 0.571247 0.988133
C  -1.140237 0.835669 -1.264744
C  -4.293684 -1.284728 -0.173168
C  -1.907636 -1.989321 -0.831128
C  -3.548641 0.183472 1.781572
C  -4.096472 -1.199701 1.359884
C  -0.572788 -1.580669 -1.499544
C  -3.493258 1.571065 -0.979857
C  -0.106334 -0.224603 -1.005068
C  1.114773 0.042424 -0.396362
C  1.639402 1.41394 -0.21363
C  2.009672 -1.012444 0.117535
C  2.31595 1.945528 0.884389
C  3.403871 -1.052072 0.096918
C  2.762992 3.301167 0.710629
C  3.979179 -2.185145 0.768876
C  2.464332 3.825873 -0.537764
C  3.037612 -3.023579 1.345275
H  -3.256037 -0.796333 -2.041032
H  -1.963947 1.603022 1.209559
H  -1.448444 -0.104552 1.2131
H  -0.851152 1.833675 -0.900499
H  -1.412546 0.906544 -2.335706
H  -4.571702 -2.314883 -0.462559
H  -5.141394 -0.645654 -0.483312
H  -2.303068 -2.904001 -1.311404
H  -1.72993 -2.245726 0.228246
H  -4.33198 0.957839 1.678887
H  -3.270273 0.173546 2.851267
H  -3.406898 -1.993882 1.701908
H  -5.060638 -1.388143 1.863439
H  -0.732542 -1.509796 -2.597942
H  0.181483 -2.365608 -1.340766
H  -3.07939 2.560581 -0.729713
H  -3.636937 1.496411 -2.069046
H  -4.457274 1.43966 -0.473037
H  2.487357 1.367913 1.796106
H  3.998818 -0.283326 -0.401943
H  3.296353 3.865448 1.478584
H  5.053476 -2.371821 0.82719
H  2.697287 4.807922 -0.94622
H  3.18557 -3.938605 1.91642
