program: Gaussian 09
title: 000041368
version: EM64L-G09RevD.01
frameworkgroup: C1[X(C14H18ClN3O2)]
method: RPBEPBE
basis: SDD
operation: Freq
keyword: #p
keyword: freq=noraman
keyword: PBEPBE/SDD
title: #p freq=noraman PBEPBE/SDD
converged: YES YES NO NO
title: Mulliken charges:
elementType: Cl O O N N N C C C C C C C C C C C C C C H H H H H H H H H H H H H H H H H H
charge: -0.051995 -0.450288 -0.240430 -0.090124 -0.067529 -0.106359 0.305511 -0.068663 -0.159509 -0.769758 -0.717627 -0.732427 -0.145972 0.426756 -0.270462 -0.319201 -0.374251 -0.204277 -0.180669 -0.124636 0.182948 0.237345 0.206093 0.216036 0.230261 0.191361 0.255318 0.229060 0.259416 0.210590 0.195828 0.360912 0.278260 0.271645 0.229648 0.269358 0.256995 0.260836
chargesum: 0.00000
title: Mulliken charges with hydrogens summed into heavy atoms:
elementType: Cl O O N N N C C C C C C C C C C C C C C
charge: -0.051995 -0.089376 -0.240430 -0.090124 -0.067529 -0.106359 0.305511 0.114285 0.077837 -0.117368 -0.041889 -0.066593 0.132288 0.426756 0.001183 -0.089553 -0.104893 0.052718 0.080167 -0.124636
polarizability: 2.34327147e+02 3.83841086e+00 1.62362951e+02 -9.39424073e+00 7.50379557e-01 1.57861364e+02
1716.lowfreq: -9.1053 -2.9353 0.0017 0.0023 0.0027 4.2473 14.8599 20.1064 38.1830
frequency: 14.0844 20.1037 38.1636 54.9285 69.3394 92.2353 97.3233 114.5513 165.7444 178.2044 200.4749 226.3343 246.2223 251.9969 263.9928 286.4159 294.4216 300.4965 321.3816 348.5883 353.1704 378.5295 400.2966 411.6499 442.8959 470.8406 511.5897 522.7221 589.8112 623.7618 645.3023 654.5747 676.6777 697.8881 722.3697 733.7972 791.8290 800.3044 811.2010 828.0314 837.6148 859.6161 864.2429 914.1868 921.1565 927.8434 933.2632 937.4344 950.7422 957.5889 958.5571 991.0140 994.3741 1011.4415 1033.9544 1072.8786 1088.8248 1108.7188 1114.8438 1146.6767 1161.4481 1179.1326 1191.1731 1200.0835 1226.2972 1245.4839 1252.2272 1279.9429 1290.5829 1304.0225 1307.6688 1329.5955 1342.4382 1357.7463 1367.9326 1372.4592 1373.3134 1395.8742 1401.1226 1425.3382 1431.2463 1452.0401 1466.3770 1469.8904 1474.3904 1478.2444 1490.2316 1503.0544 1584.5567 1602.1771 2880.9483 2956.6145 2974.0288 2990.3347 3032.1854 3046.0229 3064.6458 3068.3368 3085.5222 3098.3626 3110.9485 3146.3918 3162.5571 3171.9547 3181.6991 3249.8276 3259.7230 3301.7150
redmass: 5.6908 4.4655 3.4687 4.7214 4.3939 6.5652 6.9929 5.2631 5.4219 3.9002 1.2304 3.7651 3.5791 1.4555 1.5764 1.7728 2.1409 6.5460 5.8274 2.6226 4.7033 3.0872 6.1337 2.9789 2.7897 3.6632 3.1463 3.2775 6.3132 7.1272 2.5734 2.0477 1.7536 3.6048 5.8095 4.7530 2.3842 1.7953 1.4444 1.7801 3.6981 1.4129 3.2924 5.4868 2.2255 1.3886 1.6597 1.7237 1.4074 3.1923 1.4417 3.8492 4.0656 1.5502 1.5099 2.6048 4.0004 1.3174 2.3334 4.0866 1.6428 1.4276 1.9440 2.2444 2.6159 2.6835 2.6599 1.4271 1.3319 1.5639 2.8129 2.1274 1.7432 1.4159 6.0270 1.2086 1.1987 1.2390 3.8416 1.6062 2.4156 1.0536 1.0540 2.2409 1.0503 1.0719 1.0542 1.0671 7.1926 6.9438 1.0815 1.0368 1.0369 1.0376 1.0840 1.0995 1.0982 1.0967 1.0970 1.0992 1.0995 1.0878 1.0889 1.0962 1.0978 1.0978 1.1014 1.0665
irintensity: 0.0339 0.1811 0.2200 0.1820 0.2131 1.6025 0.1932 3.4920 0.9425 1.2785 2.2034 1.6153 0.6059 1.7070 0.1286 0.6356 1.1330 0.2600 2.5415 2.8794 3.0217 2.8140 8.4262 0.0753 2.3321 7.9307 18.8735 4.4261 21.1136 1.6894 69.6985 4.2030 87.3993 0.9991 62.0803 22.3647 4.8677 55.4203 26.4532 48.5871 30.4226 11.4334 19.3761 17.4322 60.1187 0.8439 26.3174 13.8583 11.1006 24.2846 4.2373 54.1578 59.0544 15.2625 6.5939 48.8619 28.5990 13.4546 31.2382 26.0194 148.0424 21.1802 56.0413 91.5168 26.0881 82.4074 8.8987 1.7345 3.2953 14.0449 1.2096 20.1535 14.5010 35.1622 2.3466 18.6399 17.5586 10.6819 2.8452 71.1485 85.2219 1.1733 0.9357 189.4731 2.5465 18.1438 13.9834 32.3882 6.2668 10.4516 57.3304 31.2442 38.4571 33.2101 22.4968 38.5269 30.5742 48.1613 44.4950 18.9764 20.7748 18.3284 1.7143 4.5408 0.5346 1.2872 0.8802 292.7664
temp: 298.150 k
press: 1.00000 atm
elementType: 17 8 8 7 7 7 6 6 6 6 6 6 6 6 6 6 6 6 6 6 1 1 1 1 1 1 1 1 1 1 1 1 1 1 1 1 1 1
symmnumber: 1
zpe: 789625.8 jmol-1
zpe.correction: 0.300753 hartree
zpe.thermalcorrener: 0.320532 hartree
zpe.thermalcorrenthalpy: 0.321476 hartree
zpe.thermalcorrgfe: 0.250145 hartree
zpe.sumelectzpe: -1317.510618 hartree
zpe.sumelectthermal: -1317.490839 hartree
zpe.sumelectthermalent: -1317.489895 hartree
zpe.sumelectthermalfe: -1317.561226 hartree
dipole: 0.5262 -0.7969 2.3873
dipole: 2.5712
quadrupole: -139.9477 -134.9877 -118.9149
quadrupole: 1.7908 6.9320 -4.9383
quadrupole: -8.6643 -3.7043 12.3685 1.7908 6.9320 -4.9383
hfenergy: -1317.8113707 hartree
pointgroup: C01 [X(C14H18Cl1N3O2)]
dipole: -0.3286076 -0.2941323 -0.9103827 debye
polarizability: 229.0500163|-16.0280668|165.8850444|-14.4533951|1.9356835|159.6164018 unknown
InChI: InChI=1S/C14H18ClN3O2/c1-14(2,3)12(19)13(18-9-16-8-17-18)20-11-6-4-10(15)5-7-11/h4-9,12-13,19H,1-3H3
charge 0 multiplicity 1
38 atoms
Cl 5.609017 -1.770137 -0.586526
O  -2.773022 0.481016 1.478429
O  -0.155397 -0.441525 0.613307
N  -0.706121 1.707209 -0.31616
N  -1.150286 2.551123 0.716602
N  0.157299 3.725961 -0.78717
C  -3.06629 -1.413961 -0.043065
C  -2.522664 0.04562 0.115931
C  -1.04082 0.263338 -0.306339
C  -2.701493 -1.979206 -1.441887
C  -2.531809 -2.353469 1.068132
C  -4.613256 -1.315564 0.078507
C  0.075419 2.437655 -1.191115
C  1.184793 -0.695732 0.235151
C  -0.603758 3.745252 0.378222
C  1.652251 -0.777536 -1.099036
C  2.063372 -0.945105 1.315775
C  3.005061 -1.10588 -1.347083
C  3.41049 -1.276711 1.0706
C  3.865676 -1.34999 -0.262051
H  -3.092474 0.681959 -0.606819
H  -0.907688 -0.086463 -1.345765
H  -2.990108 -1.286087 -2.25752
H  -1.621273 -2.204977 -1.52992
H  -3.241726 -2.928305 -1.611157
H  -3.02641 -3.339955 0.989707
H  -2.746533 -1.924461 2.060532
H  -1.441764 -2.499928 0.991402
H  -4.891593 -0.83705 1.032427
H  -5.065047 -2.323898 0.044043
H  -5.045901 -0.719657 -0.748619
H  -2.344029 1.383362 1.585502
H  0.551658 2.018338 -2.072756
H  -0.759918 4.637737 0.977281
H  0.991518 -0.61435 -1.956231
H  1.675581 -0.87668 2.336035
H  3.375514 -1.174225 -2.373884
H  4.093629 -1.469816 1.902417
