program: Gaussian 09
title: 000005383
version: EM64L-G09RevD.01
frameworkgroup: C1[X(C9H16N4OS)]
method: RPBEPBE
basis: SDD
operation: Freq
keyword: #p
keyword: freq=noraman
keyword: PBEPBE/SDD
title: #p freq=noraman PBEPBE/SDD
converged: NO YES NO NO
title: Mulliken charges:
elementType: S O N N N N C C C C C C C C C H H H H H H H H H H H H H H H H
charge: 0.210191 -0.298736 -0.030435 -0.174051 -0.219865 -0.383370 0.211112 -0.157950 -0.685649 -0.678380 -0.678492 -0.040321 -0.634785 0.272938 -0.598222 0.202937 0.229738 0.229546 0.230465 0.219563 0.214476 0.214467 0.219584 0.230457 0.291753 0.240480 0.240735 0.410014 0.239945 0.253163 0.218691
chargesum: 0.00000
title: Mulliken charges with hydrogens summed into heavy atoms:
elementType: S O N N N N C C C C C C C C C
charge: 0.210191 -0.298736 -0.030435 -0.174051 -0.219865 0.026645 0.211112 -0.157950 -0.023428 -0.013876 -0.013984 -0.040321 0.138184 0.272938 0.113578
polarizability: 2.20267269e+02 1.89689848e+00 1.47405169e+02 -4.41915680e-01 4.08382422e-01 9.19138396e+01
1716.lowfreq: -44.7516 -8.2665 -3.9458 0.0018 0.0022 0.0028 5.1094 15.8278 51.2510
frequency: -44.7495 15.3437 51.2350 71.9766 102.6194 103.4570 153.0606 175.1932 179.7487 186.2178 201.5327 236.1680 253.4126 254.2419 258.8012 284.0285 311.2706 327.9523 351.0093 380.0044 393.1970 432.6426 445.5629 509.8944 576.4385 580.1598 607.1816 610.9621 677.6967 704.0046 732.7720 811.3509 857.3091 877.3347 924.3353 930.5373 950.6886 962.1471 1021.0180 1023.1179 1035.5385 1053.3106 1087.6619 1122.9294 1128.1925 1161.7983 1192.7938 1206.2223 1219.0913 1223.9974 1250.5522 1272.8457 1374.8132 1376.8936 1400.6074 1404.2003 1432.5162 1451.3582 1460.4503 1461.2234 1461.2986 1469.7474 1472.7351 1473.2851 1477.7689 1489.3494 1491.3404 1499.5829 1516.1955 1580.1044 1665.1522 2977.0100 2979.8154 2983.2753 2984.0225 2991.9837 3067.8942 3069.7725 3073.6498 3079.0187 3084.3372 3087.2995 3093.0948 3104.4196 3109.8099 3119.8282 3141.4014
redmass: 1.0209 3.0297 6.0853 6.0020 3.9148 4.6098 3.0359 3.4866 1.0918 1.1452 2.6571 1.6683 1.9357 1.1300 2.4512 3.9626 2.9514 5.8655 2.6959 3.4385 5.0890 3.9322 5.6365 4.2379 4.2748 10.8755 8.5394 7.9954 8.2783 10.2200 5.0208 3.1512 3.9064 1.1059 1.7453 1.6717 1.2048 3.9809 1.3900 2.2789 2.2691 6.3156 2.1063 1.2948 1.2801 1.7381 6.6022 2.8609 3.1960 3.3064 3.0934 3.9884 1.1829 1.1894 1.2879 1.2772 1.1687 1.0484 1.0457 1.0489 1.0637 2.3724 1.0505 1.0612 1.0706 1.0500 1.0436 1.4921 4.9025 1.4440 7.5771 1.0346 1.0349 1.0352 1.0364 1.0358 1.0977 1.1031 1.1005 1.0997 1.1011 1.1004 1.0996 1.1000 1.1020 1.0984 1.0871
irintensity: 0.0436 0.0131 0.2130 0.6990 0.9983 11.3823 1.5454 8.9829 0.6450 0.3191 0.2305 0.7355 0.5500 0.0350 1.9787 0.1451 7.0947 22.1596 0.2534 5.3949 11.9881 2.3999 0.5329 0.7778 22.1023 0.0293 0.1793 0.4272 24.0764 13.0460 3.8179 2.0264 57.1844 102.1751 2.1204 2.1597 0.1751 23.7165 0.0921 5.8733 31.5405 28.6133 143.2405 7.3745 1.3941 8.8888 119.2079 8.0198 6.1812 166.0859 36.7023 129.9503 19.1037 21.9479 7.0284 30.3315 7.2098 0.0089 16.4105 0.9635 0.4628 1.2486 12.7393 25.7717 21.5045 11.6421 20.8841 111.2397 277.5802 497.6135 328.5315 22.6712 24.1908 77.9055 29.0612 30.4283 27.1910 24.6890 0.4172 65.7268 13.2838 10.3701 74.6061 28.2972 34.1138 1.3236 454.2257
temp: 298.150 k
press: 1.00000 atm
elementType: 16 8 7 7 7 7 6 6 6 6 6 6 6 6 6 1 1 1 1 1 1 1 1 1 1 1 1 1 1 1 1
symmnumber: 1
zpe: 654272.5 jmol-1
zpe.correction: 0.249199 hartree
zpe.thermalcorrener: 0.265728 hartree
zpe.thermalcorrenthalpy: 0.266672 hartree
zpe.thermalcorrgfe: 0.204541 hartree
zpe.sumelectzpe: -1043.679052 hartree
zpe.sumelectthermal: -1043.662524 hartree
zpe.sumelectthermalent: -1043.661579 hartree
zpe.sumelectthermalfe: -1043.723710 hartree
dipole: 3.6029 -0.7050 -0.0084
dipole: 3.6712
quadrupole: -101.5157 -94.2677 -98.2832
quadrupole: -7.9250 0.1052 -0.0287
quadrupole: -3.4935 3.7545 -0.2610 -7.9250 0.1052 -0.0287
hfenergy: -1043.9282516 hartree
pointgroup: C01 [X(C9H16N4O1S1)]
dipole: -1.4126125 -0.3011055 0.0084227 debye
polarizability: 220.3040043|-0.6734371|147.3643662|-1.0056353|-0.2073825|91.9179066 unknown
InChI: InChI=1S/C9H16N4OS/c1-9(2,3)6-11-12-8(15-6)13(5)7(14)10-4/h10H,1-5H3
charge 0 multiplicity 1
31 atoms
S  -0.925523 -1.502565 -0.0056
O  4.195021 -0.782198 -0.026439
N  -1.077492 1.168902 0.006344
N  1.840555 -0.976456 -0.016036
N  0.290326 0.880249 -0.000368
N  2.908158 1.171384 -0.010861
C  -3.385547 0.120487 0.011112
C  -1.86779 0.108698 0.004769
C  -3.883967 1.590406 0.017218
C  -3.90401 -0.613183 1.28373
C  -3.914279 -0.605871 -1.261584
C  0.571491 -0.437229 -0.0074
C  2.000816 -2.446246 -0.020568
C  3.079553 -0.182513 -0.021722
C  4.075623 2.058297 -0.014686
H  -4.98935 1.598346 0.022916
H  -3.518455 2.130872 0.906575
H  -3.527672 2.134954 -0.873401
H  -3.532958 -0.122601 2.200959
H  -5.008952 -0.590352 1.298841
H  -3.582666 -1.670822 1.302541
H  -3.595773 -1.664224 -1.287756
H  -5.019244 -0.580223 -1.268942
H  -3.548485 -0.111578 -2.178927
H  3.082032 -2.650049 -0.028804
H  1.534637 -2.886949 -0.920349
H  1.547769 -2.891292 0.88376
H  1.929743 1.535694 -0.012358
H  4.555693 2.096206 -1.010737
H  4.831622 1.704109 0.706837
H  3.751223 3.073744 0.265035
