program: Gaussian 09
title: 000041318
version: EM64L-G09RevD.01
frameworkgroup: C1[X(C17H15NO3)]
method: RPBEPBE
basis: SDD
operation: Freq
keyword: #p
keyword: freq=noraman
keyword: PBEPBE/SDD
title: #p freq=noraman PBEPBE/SDD
converged: YES YES NO NO
title: Mulliken charges:
elementType: O O O N C C C C C C C C C C C C C C C C C H H H H H H H H H H H H H H H
charge: -0.234013 -0.230602 -0.198266 -0.225800 0.039869 -0.698509 0.301681 0.142406 0.275339 0.401303 -0.437359 -0.350000 -0.425107 -0.315565 -0.237189 -0.253905 -0.235538 0.197814 -0.771423 0.289677 -0.742223 0.243823 0.247298 0.244934 0.258706 0.242047 0.262691 0.230563 0.225587 0.225822 0.258499 0.254355 0.242576 0.251337 0.256554 0.262618
chargesum: 0.00000
title: Mulliken charges with hydrogens summed into heavy atoms:
elementType: O O O N C C C C C C C C C C C C C C C C C
charge: -0.234013 -0.230602 -0.198266 -0.225800 0.039869 -0.207388 0.301681 0.142406 0.275339 0.401303 -0.192426 -0.091294 -0.183059 -0.052873 -0.006626 -0.028317 -0.009716 0.197814 -0.015993 0.289677 0.028287
polarizability: 2.42736614e+02 -1.70131164e+01 2.37374771e+02 1.03386223e+01 8.56563801e+00 1.34826254e+02
1716.lowfreq: -4.3522 -0.9316 -0.0003 -0.0002 0.0004 8.0959 22.5460 46.0571 54.7032
frequency: 22.3836 46.0511 54.6908 57.2899 66.7424 79.9654 90.6839 103.6525 129.6456 157.0402 161.7576 217.1652 240.8202 250.8039 277.0564 293.2385 346.4921 353.6388 384.5723 424.7201 435.8395 468.8441 496.1359 522.4120 532.4527 539.0878 557.0547 562.2980 565.8954 584.5352 625.9711 643.1919 691.5024 710.3820 741.5888 751.2195 760.9094 779.4835 789.8992 813.4526 836.8396 867.6191 900.8898 933.4891 941.2915 963.2259 965.0799 979.4431 983.7050 986.3695 994.9554 1027.2405 1035.0099 1039.3257 1048.8816 1073.2182 1105.0798 1133.4875 1147.3799 1171.2736 1176.9016 1183.8191 1202.1686 1218.0276 1240.0455 1268.1327 1305.6313 1342.7029 1380.0799 1381.2268 1383.1716 1393.1792 1428.6404 1431.9693 1448.9727 1451.7285 1452.3598 1453.6617 1462.6868 1466.3148 1480.3031 1586.8370 1587.9934 1605.5715 1614.7500 1619.6946 1697.4633 2982.2873 3000.8021 3007.7962 3026.5982 3091.2336 3102.2708 3122.4604 3130.7843 3135.0656 3135.1214 3140.4653 3154.2534 3155.7510 3181.8756 3183.0009
redmass: 5.8728 4.4399 1.9253 2.6133 2.6488 3.6628 4.0448 4.2356 4.8218 2.5991 1.3854 4.3796 2.1871 6.4263 5.3209 3.8039 3.5830 5.1166 6.8441 2.8660 6.2336 2.9429 4.9752 4.2056 3.7544 5.2605 3.5912 3.7203 3.4428 4.3855 6.1301 6.1353 5.7781 3.0961 1.5308 5.3081 6.0861 1.5336 2.4370 4.5701 5.9022 1.3601 1.5455 2.6163 2.1219 1.9371 2.1214 1.5672 1.9771 1.4029 7.2005 2.1720 1.6258 1.6654 2.5060 1.9040 1.8496 1.1462 2.8706 1.1160 1.2063 1.4048 2.1890 3.2134 2.4079 2.6390 1.5733 5.5737 6.3016 1.3172 1.2163 3.0321 1.1782 2.7664 1.0526 1.1352 2.4265 1.0666 2.7470 1.0833 3.4653 7.1426 6.6014 8.3009 8.1495 7.2435 11.0637 1.0610 1.0372 1.0378 1.0992 1.0971 1.0945 1.0861 1.0883 1.0999 1.0915 1.1026 1.0935 1.0973 1.0967 1.0951
irintensity: 0.6392 1.1825 0.7067 0.7108 3.7314 1.0947 2.0943 1.6255 1.2487 6.4450 0.8608 4.1213 9.3125 2.4077 2.0508 2.2901 9.9696 0.8234 5.9067 3.7690 4.0996 2.6921 13.3864 5.9550 5.4396 0.8102 1.3225 7.7882 2.2902 29.9082 2.3994 7.8540 1.5897 0.2821 104.5914 2.0545 106.4046 2.7533 45.7895 18.6563 23.2609 1.6487 8.4043 25.0242 26.2945 5.2815 33.7960 0.7514 4.1830 1.3967 3.3025 4.9623 7.8527 9.0064 2.6090 9.3272 0.9078 0.0135 219.2977 5.0960 3.0828 2.8730 3.0899 37.9834 9.6267 4.2271 7.1729 207.8400 21.9538 68.0297 47.8620 10.4170 15.5992 12.0676 17.5935 36.7345 24.3227 25.8858 1.6539 19.5327 3.1438 1.5656 1.1142 122.8982 44.6871 0.1430 141.9959 14.4282 4.7278 0.4493 7.2188 8.1493 5.2626 1.6788 5.7237 12.3317 14.7861 5.4638 24.9668 35.8483 5.7110 8.4803
temp: 298.150 k
press: 1.00000 atm
elementType: 8 8 8 7 6 6 6 6 6 6 6 6 6 6 6 6 6 6 6 6 6 1 1 1 1 1 1 1 1 1 1 1 1 1 1 1
symmnumber: 1
zpe: 725404.5 jmol-1
zpe.correction: 0.276292 hartree
zpe.thermalcorrener: 0.295306 hartree
zpe.thermalcorrenthalpy: 0.296250 hartree
zpe.thermalcorrgfe: 0.227559 hartree
zpe.sumelectzpe: -935.740522 hartree
zpe.sumelectthermal: -935.721508 hartree
zpe.sumelectthermalent: -935.720564 hartree
zpe.sumelectthermalfe: -935.789255 hartree
dipole: 1.8256 -2.3637 3.8700
dipole: 4.8884
quadrupole: -111.5874 -105.7977 -128.1579
quadrupole: 12.5881 -3.2583 2.7668
quadrupole: 3.5936 9.3833 -12.9769 12.5881 -3.2583 2.7668
hfenergy: -936.0168139 hartree
pointgroup: C01 [X(C17H15N1O3)]
dipole: -0.4682018 0.567415 1.7770037 debye
polarizability: 236.6997682|-12.0746931|235.7549012|-29.1126655|15.6545517|142.4829703 unknown
InChI: InChI=1S/C17H15NO3/c1-11(19)18(21-12(2)20)16-9-5-7-14-10-13-6-3-4-8-15(13)17(14)16/h3-9H,10H2,1-2H3
charge 0 multiplicity 1
36 atoms
O  1.793227 1.094126 0.496602
O  1.944679 0.009932 -2.967921
O  3.614638 -0.36651 0.868876
N  1.487484 0.318021 -0.726802
C  -0.687275 -0.719233 -0.094802
C  -2.874282 -1.543035 0.533392
C  -1.459866 -1.906706 0.102419
C  -1.544503 0.451714 0.185906
C  -2.843196 -0.021838 0.554518
C  0.662331 -0.839944 -0.515436
C  -0.912358 -3.179352 -0.126417
C  -1.285089 1.841756 0.132316
C  -3.875821 0.879157 0.86612
C  1.217293 -2.124282 -0.739512
C  0.434719 -3.283819 -0.556422
C  -2.329749 2.743357 0.439301
C  -3.614713 2.270549 0.804987
C  2.164604 0.662511 -1.910149
C  3.117488 1.844647 -1.823401
C  2.89843 0.564427 1.263621
C  2.972671 1.32152 2.567625
H  -3.126459 -1.96669 1.525638
H  -3.630511 -1.9310 -0.176946
H  -1.516975 -4.081811 0.018641
H  -0.293811 2.21547 -0.13424
H  -4.870656 0.515811 1.148822
H  2.258942 -2.197765 -1.062878
H  0.877211 -4.267851 -0.742922
H  -2.143317 3.8224 0.396723
H  -4.410213 2.986127 1.041664
H  3.411073 2.115869 -2.848062
H  4.024639 1.566744 -1.256579
H  2.655182 2.712006 -1.322906
H  4.008751 1.31701 2.938835
H  2.605866 2.353112 2.452596
H  2.331866 0.81527 3.312695
