program: Gaussian 09
title: 000005423
version: EM64L-G09RevD.01
frameworkgroup: C1[X(C16H26O3)]
method: RPBEPBE
basis: SDD
operation: Freq
keyword: #pfreq=noraman
keyword: PBEPBE/SDD
title: #p freq=noraman PBEPBE/SDD
converged: YES YES NO NO
title: Mulliken charges:
elementType: O O O C C C C C C C C C C C C C C C C H H H H H H H H H H H H H H H H H H H H H H H H H H
charge: -0.445645 -0.430260 -0.245096 -0.357312 -0.356386 -0.463975 -0.397320 -0.159788 -0.525982 -0.152062 -0.180369 -0.705025 -0.141355 -0.216386 -0.471030 -0.206627 -0.185033 -0.471020 0.212172 0.223790 0.190647 0.191120 0.186474 0.200394 0.197951 0.217236 0.213433 0.220196 0.225055 0.197199 0.190811 0.220053 0.224351 0.220364 0.195677 0.242163 0.216549 0.238155 0.212802 0.332120 0.236710 0.220816 0.245895 0.247006 0.391531
chargesum: 0.00000
title: Mulliken charges with hydrogens summed into heavy atoms:
elementType: O O O C C C C C C C C C C C C C C C C
charge: -0.113525 -0.038729 -0.245096 0.057126 0.021208 -0.065630 0.033349 0.060408 -0.103728 0.038749 0.039684 -0.064633 0.100808 0.000163 -0.020073 0.030083 0.035783 0.021880 0.212172
polarizability: 2.43434241e+02 -2.15321316e+01 1.93767319e+02 8.35253381e+00 -1.14772717e+01 1.46737855e+02
1716.lowfreq: -5.1551 -0.0006 -0.0005 0.0008 1.5070 6.3069 15.4772 28.4639 31.9530
frequency: 15.2970 28.4567 31.7860 36.1104 39.0429 50.9388 71.5150 81.7859 88.8892 96.1077 113.3730 120.0656 141.2898 157.3808 170.7233 196.1162 221.4282 229.3608 235.6029 253.6007 273.9395 279.9620 300.5916 340.9472 351.1033 367.8997 405.0419 456.7001 464.4217 467.1473 509.2099 518.6226 528.4640 567.1320 602.2002 673.4610 726.9171 753.4531 767.1683 784.0639 809.3326 835.8962 866.9339 882.4948 886.5588 897.2530 937.5994 941.7957 950.2797 957.9987 974.4806 993.2180 994.9297 1001.2290 1007.0540 1033.5446 1043.8769 1056.3453 1062.0194 1076.8967 1089.6730 1097.2053 1108.9959 1126.2204 1159.6871 1167.0647 1187.6352 1198.2157 1200.2560 1213.6343 1227.5387 1243.9266 1251.7681 1255.8397 1264.3865 1282.0078 1283.9844 1285.1304 1288.3691 1296.0551 1298.4012 1302.8438 1308.6777 1328.3542 1337.3522 1347.6952 1355.0418 1361.5334 1395.2494 1395.7293 1441.4632 1451.8745 1455.4396 1459.2549 1466.3076 1473.8660 1479.0023 1485.3069 1501.7809 1640.1780 1659.6478 1677.7491 1687.8514 2933.1819 2941.6766 2947.4368 2951.2642 2957.3938 2960.8242 2968.3009 2978.3324 2988.6442 2995.5326 3006.6571 3016.6645 3034.7655 3040.1367 3051.3844 3052.2148 3063.7667 3069.5437 3072.8578 3074.1869 3076.0707 3078.6945 3098.2315 3105.4227 3487.4212 3533.5906
redmass: 5.5314 6.2674 5.1109 5.3120 5.2415 4.1082 2.9340 3.0072 2.0148 3.0774 3.3821 2.5913 1.7330 2.2674 2.8777 2.4341 2.6025 3.4016 1.2830 2.4979 2.7443 1.4531 2.1497 2.6541 3.4851 2.8392 3.6458 3.1468 2.5822 2.8107 2.5825 3.5701 2.7134 3.2774 2.8916 1.3654 1.0755 1.1430 2.1606 1.5566 2.0566 1.3269 1.9148 2.0698 1.9236 1.9207 2.3196 1.2319 1.7180 2.3074 1.1576 3.3320 1.9911 1.2898 3.2398 1.9324 3.3445 1.7232 1.8276 2.2925 2.3772 2.3893 2.0631 1.8111 1.9802 1.5412 1.4758 1.4455 1.2068 1.3283 1.2762 1.2918 1.2903 1.3972 1.2401 1.4009 1.2623 1.1214 1.1223 1.2342 1.3294 1.2853 1.2251 1.3466 1.4116 1.4734 1.6033 1.7437 1.6113 1.2316 1.0924 1.0992 1.1027 1.0866 1.0742 1.0429 1.0878 1.0512 1.0901 6.2702 8.2328 6.1420 6.6418 1.0695 1.0810 1.0597 1.0612 1.0637 1.0398 1.0615 1.0631 1.0957 1.0652 1.0954 1.0999 1.0936 1.1026 1.0953 1.0979 1.0939 1.0938 1.0997 1.0895 1.0895 1.0951 1.0907 1.0885 1.0639 1.0658
irintensity: 0.3474 0.7185 1.5941 0.2979 1.2486 0.2424 0.5351 1.6396 0.9898 1.5634 0.2030 0.4330 0.2778 0.2940 1.0314 5.5884 6.8172 5.3476 0.4035 0.9112 26.1486 85.2960 34.5712 0.0907 9.7603 7.1408 5.4770 11.3617 3.8344 0.3062 14.6532 30.3219 2.5511 3.5277 14.6652 133.1811 12.6566 0.2280 9.1842 4.7161 0.8241 2.4765 11.4749 7.1978 4.3561 3.4890 29.5133 2.9866 13.5739 23.7047 70.5506 0.8460 134.5107 23.0506 93.2587 1.6386 5.0904 86.2368 89.9816 1.6707 50.3939 21.5427 14.8735 17.0621 7.5429 2.4168 14.0268 3.5778 0.3962 15.4557 2.0807 3.3626 3.2127 7.3330 0.7595 1.8703 0.2689 0.4089 0.0550 4.2899 3.3874 3.5339 2.9839 3.8262 13.2372 0.2237 2.6529 37.0467 19.3520 14.1607 31.8023 3.7181 22.6419 4.3904 0.3557 12.0724 6.3360 2.4441 20.5152 2.3199 143.1184 4.6477 1.2302 67.5809 50.8608 2.6376 36.3003 16.0584 34.1193 66.1714 31.8559 4.1256 38.6556 11.2498 3.4610 18.0400 37.3671 1.8263 145.4846 9.0301 1.6573 40.7741 16.6979 42.1939 37.3279 12.5890 34.3689 67.9091 6.5871
temp: 298.150 k
press: 1.00000 atm
elementType: 8 8 8 6 6 6 6 6 6 6 6 6 6 6 6 6 6 6 6 1 1 1 1 1 1 1 1 1 1 1 1 1 1 1 1 1 1 1 1 1 1 1 1 1 1
symmnumber: 1
zpe: 1009345.8 jmol-1
zpe.correction: 0.384440 hartree
zpe.thermalcorrener: 0.407750 hartree
zpe.thermalcorrenthalpy: 0.408694 hartree
zpe.thermalcorrgfe: 0.328217 hartree
zpe.sumelectzpe: -849.419969 hartree
zpe.sumelectthermal: -849.396659 hartree
zpe.sumelectthermalent: -849.395715 hartree
zpe.sumelectthermalfe: -849.476192 hartree
dipole: -1.2924 -1.1804 -1.9805
dipole: 2.6432
quadrupole: -115.3478 -109.9367 -117.5373
quadrupole: -10.5061 -5.1024 -4.5129
quadrupole: -1.0739 4.3372 -3.2633 -10.5061 -5.1024 -4.5129
hfenergy: -849.8044089 hartree
pointgroup: C01 [X(C16H26O3)]
dipole: -0.5083869 -0.4676842 -0.7773063 debye
polarizability: 243.8417315|-21.2013744|193.4547677|7.9803212|-11.2739213|146.6429147 unknown
InChI: InChI=1S/C16H26O3/c1-2-3-4-5-6-9-12-15(17)13-10-7-8-11-14-16(18)19/h6-10,13,15,17-18H,2-5,11-12,14H2,1H3
charge 0 multiplicity 1
45 atoms
O  5.367972 0.362254 0.430381
O  -3.516116 0.995057 -0.803193
O  -2.454566 1.272541 1.242712
C  -0.907108 -2.587758 0.383237
C  -2.297498 -2.828123 -0.246266
C  0.259972 -3.134081 -0.484332
C  -3.457233 -2.404411 0.686178
C  1.610288 -2.737315 0.073448
C  3.880811 -1.587319 -0.011938
C  4.097984 -0.053829 -0.21211
C  2.575837 -2.069143 -0.608719
C  -4.841821 -2.464681 0.001981
C  3.001564 0.762471 0.41793
C  2.11734 1.525506 -0.287724
C  -1.118211 3.678823 0.15903
C  0.983048 2.236494 0.299518
C  0.085811 2.972417 -0.422223
C  -2.457538 3.126663 -0.400595
C  -2.771773 1.737042 0.124912
H  -0.763964 -1.501053 0.5466
H  -0.867718 -3.061685 1.386091
H  -2.412659 -3.900162 -0.510631
H  -2.362983 -2.265954 -1.202318
H  0.160516 -2.75854 -1.522233
H  0.170976 -4.240447 -0.535225
H  -3.258142 -1.384247 1.078188
H  -3.462527 -3.061527 1.578904
H  1.783617 -2.981394 1.134793
H  3.915485 -1.808325 1.071807
H  4.741382 -2.112806 -0.48414
H  4.141454 0.158872 -1.303563
H  2.398825 -1.815445 -1.666472
H  -5.650364 -2.152416 0.688096
H  -5.068018 -3.491848 -0.340222
H  -4.886904 -1.814204 -0.895558
H  2.917735 0.67878 1.511118
H  2.236093 1.603255 -1.380145
H  -1.122026 3.58199 1.25959
H  -1.075582 4.760572 -0.080423
H  6.082118 -0.268371 0.152055
H  0.842188 2.144503 1.386636
H  0.220237 3.054837 -1.513333
H  -2.460707 3.10114 -1.503877
H  -3.293662 3.787094 -0.093308
H  -3.735934 0.10117 -0.419056
