program: Gaussian 09
title: 000005578
version: EM64L-G09RevD.01
frameworkgroup: C1[X(C14H18N4O3)]
method: RPBEPBE
basis: SDD
operation: Freq
keyword: #p
keyword: freq=noraman
keyword: PBEPBE/SDD
title: #p freq=noraman PBEPBE/SDD
converged: YES YES NO NO
title: Mulliken charges:
elementType: O O O N N N N C C C C C C C C C C C C C C H H H H H H H H H H H H H H H H H H
charge: -0.288314 -0.304991 -0.309389 -0.126935 -0.067347 -0.634234 -0.594569 -0.702611 0.593877 0.341785 -0.673428 -0.543937 0.273621 0.288567 -0.002417 0.110074 -0.431812 -0.021839 -0.524969 -0.527441 -0.524600 0.225522 0.233372 0.266543 0.272477 0.235980 0.345342 0.318822 0.214999 0.261020 0.230153 0.256040 0.221687 0.229109 0.249901 0.233978 0.228082 0.326092 0.321789
chargesum: 0.00000
title: Mulliken charges with hydrogens summed into heavy atoms:
elementType: O O O N N N N C C C C C C C C C C C C C C
charge: -0.288314 -0.304991 -0.309389 -0.126935 -0.067347 0.029931 0.053312 -0.243716 0.593877 0.341785 -0.406885 -0.271460 0.273621 0.288567 -0.002417 0.110074 -0.195832 -0.021839 0.181202 0.179394 0.187361
polarizability: 2.68699303e+02 -2.50296627e+01 1.74752331e+02 1.04690877e+01 -7.36701350e-01 1.53671915e+02
1716.lowfreq: -8.0306 -4.2365 -0.0002 0.0003 0.0007 4.7523 19.7186 31.7023 39.0558
frequency: 19.3576 31.6476 39.0358 54.3649 71.0431 80.3373 91.5741 104.3054 130.7821 151.0267 161.9165 166.1093 193.0736 208.0268 213.5570 218.0829 240.7937 268.6110 294.2616 300.8966 323.3323 324.4457 368.3663 423.7218 427.3887 449.4166 456.4770 473.6883 478.2891 496.5561 527.5601 534.1892 539.8490 563.5862 574.6884 591.1046 638.2760 659.1625 703.2922 734.1845 746.7470 769.4438 777.5522 799.8290 865.8771 870.9898 896.8483 900.4630 911.5031 932.6034 940.3205 951.1031 989.6957 1004.5389 1036.7905 1106.8874 1111.2312 1111.3937 1113.0219 1133.2910 1149.6377 1154.5298 1158.4239 1175.1542 1180.4980 1209.3645 1213.3958 1286.9452 1294.6336 1307.7852 1320.0464 1343.0733 1357.8408 1397.9382 1416.4335 1434.4952 1438.0092 1446.0462 1452.8844 1457.5225 1458.5807 1460.0764 1465.1853 1475.1889 1478.4817 1484.2153 1486.5980 1535.5982 1567.9636 1577.4504 1601.9659 1603.9336 1623.2478 2959.7410 2973.7521 2974.9692 2976.2207 3009.4498 3073.3606 3075.4394 3081.7564 3106.3246 3119.6041 3122.4576 3127.1279 3140.4738 3155.7887 3525.1565 3565.3460 3676.9822 3726.1331
redmass: 4.7561 4.9720 4.9028 3.0810 3.3499 2.5353 3.1029 4.9646 1.6477 1.3987 1.5423 1.0908 4.5393 4.3557 4.1304 4.6108 5.2744 3.1647 5.0315 3.1660 3.2961 3.6710 5.2683 1.3565 4.4607 2.5568 3.3262 2.9036 1.2914 4.8938 1.0686 2.7306 2.2409 2.5463 6.8007 4.7947 4.3114 4.9317 7.9707 5.9411 5.1400 3.9395 7.0237 5.5731 4.9815 1.8552 2.7949 2.0450 2.4899 1.6808 9.1322 2.0617 1.6870 4.9711 5.6877 2.5282 1.2429 1.2502 1.2864 2.0319 1.3536 1.3838 1.4461 1.3253 2.4045 2.0967 1.6969 1.8599 6.0386 4.7360 1.6401 2.7510 6.7850 1.8675 1.2676 1.2405 1.5492 2.7726 1.4872 1.0758 1.1805 1.0778 1.7214 1.0604 3.1579 1.0542 1.0592 3.8651 7.0566 3.5818 1.9779 4.1377 1.4899 1.0603 1.0312 1.0322 1.0310 1.0996 1.1033 1.1054 1.0990 1.0921 1.1030 1.1032 1.1044 1.0915 1.0919 1.0449 1.0438 1.1047 1.1059
irintensity: 0.2037 0.6242 1.4560 3.3575 2.0632 3.1373 7.2300 2.9783 1.9614 2.7841 3.2341 0.2074 2.1650 0.6787 9.6595 4.1434 13.6442 5.6123 7.2388 2.2278 5.9334 9.5803 3.9139 264.6051 14.2074 5.0240 2.6825 25.0827 154.4357 11.6140 4.1017 12.3245 70.0418 34.5415 3.1393 4.5528 7.5091 8.6103 4.5168 5.9758 6.6929 10.9522 11.7690 17.8499 8.4829 12.5581 29.3592 29.1902 2.3317 11.8348 61.0266 7.2931 9.0195 97.2797 168.9861 19.2618 8.5625 8.0710 2.0632 11.5140 2.0746 4.3932 16.5468 6.2134 39.9886 12.8498 9.8733 1.9557 155.9302 41.8179 4.8013 9.1091 6.7826 55.1466 5.2298 24.5235 8.3465 141.3228 105.7165 20.0063 10.1273 2.6555 31.9141 6.3285 198.4096 18.6029 23.4152 136.6288 55.9252 140.0106 703.7649 68.4459 181.1830 33.8920 72.2239 102.6014 51.3045 10.6453 26.2482 20.8963 30.0781 26.8497 26.4504 22.7532 14.8243 3.2000 0.7330 86.3649 115.0265 83.6124 43.7727
temp: 298.150 k
press: 1.00000 atm
elementType: 8 8 8 7 7 7 7 6 6 6 6 6 6 6 6 6 6 6 6 6 6 1 1 1 1 1 1 1 1 1 1 1 1 1 1 1 1 1 1
symmnumber: 1
zpe: 811664.7 jmol-1
zpe.correction: 0.309147 hartree
zpe.thermalcorrener: 0.330855 hartree
zpe.thermalcorrenthalpy: 0.331799 hartree
zpe.thermalcorrgfe: 0.257264 hartree
zpe.sumelectzpe: -987.376557 hartree
zpe.sumelectthermal: -987.354849 hartree
zpe.sumelectthermalent: -987.353904 hartree
zpe.sumelectthermalfe: -987.428440 hartree
dipole: 3.7614 -0.5360 0.8481
dipole: 3.8929
quadrupole: -108.9749 -121.8994 -114.2981
quadrupole: -0.9149 -6.3911 1.0555
quadrupole: 6.0825 -6.8419 0.7594 -0.9149 -6.3911 1.0555
hfenergy: -987.6857036 hartree
pointgroup: C01 [X(C14H18N4O3)]
dipole: -1.4291962 -0.4409377 -0.3297313 debye
polarizability: 262.0594716|35.8400187|179.3645933|8.5635436|-3.2535733|155.699485 unknown
InChI: InChI=1S/C14H18N4O3/c1-19-10-5-8(6-11(20-2)12(10)21-3)4-9-7-17-14(16)18-13(9)15/h5-7H,4,15-16H2,1-3H3
charge 0 multiplicity 1
39 atoms
O  -1.804218 2.287032 -0.881468
O  -3.155192 -2.362093 0.178816
O  -3.782193 0.178076 -1.057065
N  4.030297 -0.288708 -0.996957
N  4.544744 1.203894 0.878772
N  2.111023 -1.612483 -1.035046
N  5.9722 1.018578 -0.971943
C  1.274165 -0.653557 1.669975
C  -0.063395 -0.431254 0.954191
C  2.502824 -0.167784 0.922198
C  -1.023889 -1.47044 0.898513
C  -0.376332 0.823785 0.380724
C  -1.616079 1.039575 -0.261162
C  -2.268713 -1.264252 0.264299
C  -2.567899 -0.01731 -0.350587
C  2.880555 -0.680611 -0.368428
C  3.391259 0.775909 1.472742
C  4.809616 0.629002 -0.343315
C  -3.050459 3.019279 -0.561548
C  -4.491154 -2.150526 0.784972
C  -3.81839 -0.528466 -2.3621
H  1.245686 -0.133385 2.648699
H  1.371945 -1.734099 1.902796
H  -0.832738 -2.44756 1.356086
H  0.343688 1.647978 0.405663
H  3.175115 1.217811 2.454743
H  1.162689 -1.825193 -0.7322
H  2.429588 -1.912441 -1.954651
H  -3.073379 3.272952 0.515911
H  -3.938254 2.42439 -0.831714
H  -2.999141 3.94133 -1.160205
H  -4.999497 -1.283919 0.327306
H  -4.390157 -1.997948 1.876306
H  -5.049211 -3.078305 0.586976
H  -3.700875 -1.617103 -2.212377
H  -3.020274 -0.144477 -3.023733
H  -4.806657 -0.304776 -2.792424
H  6.569413 1.701241 -0.514624
H  6.20509 0.62466 -1.878541
