program: Gaussian 09
title: 000005519
version: EM64L-G09RevD.01
frameworkgroup: C1[X(C26H28N6)]
method: RPBEPBE
basis: SDD
operation: Freq
keyword: #pfreq=noraman
keyword: PBEPBE/SDD
title: #p freq=noraman PBEPBE/SDD
converged: YES YES NO NO
title: Mulliken charges:
elementType: N N N N N N C C C C C C C C C C C C C C C C C C C C C C C C C C H H H H H H H H H H H H H H H H H H H H H H H H H H H H
charge: -0.097698 -0.097632 -0.008903 0.000999 -0.009075 0.000858 -0.396717 -0.396824 -0.474844 -0.452687 -0.475003 -0.452703 0.209926 0.166934 0.210173 0.166857 -0.337687 -0.333080 -0.337558 -0.332954 -0.186499 -0.187147 -0.186488 -0.187213 -0.359333 -0.369025 -0.359349 -0.369017 -0.179893 -0.179331 -0.179902 -0.179303 0.222535 0.243391 0.243517 0.222415 0.192571 0.222086 0.189030 0.233948 0.192612 0.222147 0.189014 0.233928 0.238325 0.248899 0.238264 0.248948 0.234482 0.235797 0.234485 0.235810 0.233941 0.236075 0.233943 0.236083 0.227884 0.226047 0.227888 0.226053
chargesum: 0.00000
title: Mulliken charges with hydrogens summed into heavy atoms:
elementType: N N N N N N C C C C C C C C C C C C C C C C C C C C C C C C C C
charge: -0.097698 -0.097632 -0.008903 0.000999 -0.009075 0.000858 0.069209 0.069108 -0.060187 -0.029709 -0.060244 -0.029760 0.209926 0.166934 0.210173 0.166857 -0.099362 -0.084181 -0.099294 -0.084005 0.047983 0.048650 0.047997 0.048597 -0.125393 -0.132951 -0.125406 -0.132934 0.047991 0.046716 0.047985 0.046750
polarizability: 3.51567515e+02 -2.22688882e-02 2.95118004e+02 -4.61025199e+01 -7.17556659e-02 2.72592025e+02
1716.lowfreq: -7.0039 -3.2183 0.0003 0.0006 0.0007 5.0461 7.1127 14.3214 15.4796
frequency: 1.2496 14.2161 15.1828 17.8990 17.9967 20.6471 32.0532 42.4586 47.4562 48.5762 50.1550 89.4131 92.6774 101.2852 131.5544 135.3854 158.2082 194.5751 201.2823 245.5680 250.2074 288.5518 308.3190 318.3014 338.6910 339.7980 355.7090 367.2175 388.1559 402.1342 402.2551 405.2435 406.7736 424.9628 425.4458 484.8228 506.1137 517.9770 524.2762 599.9909 605.1545 609.9182 609.9968 625.5444 627.2824 632.6533 632.6680 744.4345 751.8276 751.8504 752.4186 753.2507 756.3217 772.7441 776.0024 791.2059 832.1559 835.1059 835.2649 840.0379 841.4109 857.0707 900.1391 900.2987 902.1824 903.3614 935.4462 936.0486 939.3109 940.7684 955.5819 955.7184 956.0285 956.4194 968.5582 969.6288 973.5302 973.8347 996.8579 996.8801 998.2058 998.2518 1017.8407 1039.4213 1040.1070 1040.3880 1041.4793 1047.3931 1076.9660 1081.9726 1087.5267 1091.5714 1105.3288 1127.0499 1128.4892 1159.3308 1163.4059 1163.4503 1163.4739 1164.4192 1206.0415 1224.9157 1232.9386 1233.1455 1238.7594 1240.7194 1253.4424 1257.3768 1268.0422 1295.8257 1297.0541 1297.4689 1298.7484 1298.7905 1320.3934 1324.7468 1325.2373 1326.4660 1335.3064 1358.5302 1363.7417 1366.5198 1370.4624 1386.6469 1413.4358 1413.4701 1415.4745 1415.5222 1452.7800 1453.0081 1453.5921 1453.7145 1457.2412 1457.4821 1458.2953 1460.0908 1468.9616 1481.9730 1565.4601 1565.6402 1567.1171 1567.2166 1578.5594 1578.7194 1579.2115 1579.6053 2841.6852 2841.9128 2866.9210 2868.4366 2895.3651 2895.7612 3042.5835 3042.6906 3058.8365 3059.0906 3061.4923 3075.3110 3119.6698 3119.7408 3121.0303 3121.0423 3129.4873 3129.4942 3133.0180 3133.1108 3146.4833 3146.5024 3148.0852 3148.1163 3166.7768 3167.0088 3167.0941 3167.1987
redmass: 5.2586 5.4536 5.6081 5.9274 4.5704 5.8200 4.7678 4.7177 4.5710 4.8757 4.8651 4.4229 4.2554 4.3443 3.0451 4.2868 4.8144 4.7332 4.7067 3.0653 4.8656 4.2518 4.4348 3.4960 2.1367 2.3739 2.3376 1.9124 2.5656 3.1874 3.2543 3.4294 3.6064 4.0493 3.0471 3.2537 3.4586 3.2975 3.1534 5.1551 5.2216 5.8672 5.9272 5.6340 5.1822 4.5339 4.5659 3.1143 1.6845 1.7348 1.5867 2.4743 1.7149 1.8249 2.6462 1.4851 3.5226 4.0012 3.7456 3.6822 4.0609 4.0666 1.3309 1.3317 1.3260 1.3248 2.1858 2.1721 2.2466 2.2558 1.5103 1.5281 1.5254 1.4885 4.9833 4.6740 4.1076 3.9076 1.3402 1.3388 1.3349 1.3364 2.3606 2.4599 2.3655 2.3767 2.2972 3.5188 2.0165 1.7896 1.7526 1.5870 1.7606 1.8328 1.9148 1.6415 1.0748 1.0757 1.0758 1.1810 1.2682 1.6368 2.2085 2.3239 2.3607 2.2519 2.1568 2.1798 1.6571 1.4376 1.8733 1.3786 1.9033 1.9138 2.1206 2.5331 2.4838 2.4248 1.5103 1.4203 1.4086 1.4007 1.4692 1.3946 1.9571 1.9533 1.9755 1.9717 1.6836 1.9732 1.7907 1.7956 1.3905 1.2378 1.1763 1.1872 1.0877 1.0872 5.6947 5.6980 5.7838 5.7719 5.9050 5.9006 5.8707 5.8980 1.0715 1.0715 1.0713 1.0710 1.0718 1.0711 1.0861 1.0860 1.0878 1.0866 1.0860 1.0919 1.0880 1.0881 1.0879 1.0879 1.0889 1.0889 1.0885 1.0886 1.0943 1.0943 1.0944 1.0944 1.1017 1.1016 1.1014 1.1015
irintensity: 0.2151 1.0886 0.0396 0.0700 0.5804 0.3927 1.0019 0.0086 3.8104 3.2333 0.1088 1.1943 0.3255 0.3200 3.6774 0.1990 0.3137 1.8104 0.6459 0.7241 0.0546 1.3582 1.7759 2.4986 5.2918 2.8408 0.0123 3.9198 2.3945 2.6943 0.7386 5.1119 2.0496 0.1867 6.3064 5.7868 3.2020 1.3497 9.8588 12.4099 3.2093 6.2789 0.5450 11.0760 2.5674 2.2058 1.4430 33.7303 23.2637 53.2248 84.3390 17.3686 37.9904 40.8921 26.4372 7.1558 27.8731 8.4355 18.2814 4.2520 5.2058 8.2469 1.5535 0.5751 0.4737 0.9103 3.0674 3.0880 3.6027 8.2976 0.3694 4.4194 6.8864 0.0082 1.4251 24.7375 5.7298 0.7464 0.1348 0.6541 0.0574 1.0776 42.5608 7.7219 4.3233 2.6250 13.6811 9.3428 49.0504 78.5242 0.6469 4.8834 8.6648 62.7857 4.0355 6.7043 0.7953 3.6967 0.2829 1.3955 3.7287 2.2035 0.8963 2.1462 0.0136 2.7854 12.8826 25.4974 6.2688 9.3288 0.5206 5.0903 3.4444 2.5659 3.3541 7.8693 4.0987 2.8331 0.5133 4.8330 18.8627 4.8721 0.8242 6.1250 8.2226 5.1265 26.9471 1.0033 0.3318 29.9806 49.1541 19.0050 0.0807 6.6117 5.0273 1.8337 8.2148 5.5755 0.1377 16.7831 20.2014 0.4134 27.3683 38.8525 46.0795 6.6522 183.2160 4.8325 100.2778 125.7054 127.7886 64.9970 18.4923 3.8700 4.3192 23.3387 7.3155 34.6409 14.1809 12.9052 35.6478 2.2513 3.7123 4.1066 1.9412 4.3290 0.0312 59.2061 28.6915 27.9388 9.8384 33.9634 53.0817 4.1918
temp: 298.150 k
press: 1.00000 atm
elementType: 7 7 7 7 7 7 6 6 6 6 6 6 6 6 6 6 6 6 6 6 6 6 6 6 6 6 6 6 6 6 6 6 1 1 1 1 1 1 1 1 1 1 1 1 1 1 1 1 1 1 1 1 1 1 1 1 1 1 1 1
symmnumber: 1
zpe: 1283088.3 jmol-1
zpe.correction: 0.488703 hartree
zpe.thermalcorrener: 0.517402 hartree
zpe.thermalcorrenthalpy: 0.518346 hartree
zpe.thermalcorrgfe: 0.418928 hartree
zpe.sumelectzpe: -1333.708012 hartree
zpe.sumelectthermal: -1333.679312 hartree
zpe.sumelectthermalent: -1333.678368 hartree
zpe.sumelectthermalfe: -1333.777787 hartree
dipole: 0.0019 1.2684 0.0042
dipole: 1.2684
quadrupole: -164.1212 -169.2408 -174.0146
quadrupole: 0.0003 -1.4407 -0.0048
quadrupole: 5.0043 -0.1153 -4.8890 0.0003 -1.4407 -0.0048
hfenergy: -1334.1967144 hartree
pointgroup: C01 [X(C26H28N6)]
dipole: -0.0014834 0.4990235 0.0039755 debye
polarizability: 346.1505265|0.4481278|295.1213525|-50.2355003|-0.2234233|278.0056648 unknown
InChI: InChI=1S/C26H28N6/c1-5-13-27-23(9-1)19-31(20-24-10-2-6-14-28-24)17-18-32(21-25-11-3-7-15-29-25)22-26-12-4-8-16-30-26/h1-16H,17-22H2
charge 0 multiplicity 1
60 atoms
N  1.759645 -0.892849 0.721493
N  -1.753065 -0.900687 -0.731472
N  3.410308 -2.117332 -1.690774
N  3.056732 2.024624 0.809372
N  -3.389414 -2.170221 1.66808
N  -3.076587 2.007258 -0.790328
C  0.279944 -0.85073 0.717511
C  -0.273765 -0.845562 -0.726841
C  2.330938 -2.245009 0.513307
C  2.427354 -0.136229 1.804593
C  -2.312346 -2.260236 -0.538929
C  -2.427291 -0.138082 -1.806405
C  3.594997 -2.214925 -0.335202
C  2.232182 1.368928 1.687653
C  -3.575364 -2.251398 0.311602
C  -2.244903 1.367345 -1.673476
C  4.886346 -2.279039 0.244729
C  1.256489 2.053969 2.455405
C  -4.867062 -2.317926 -0.267307
C  -1.27331 2.068161 -2.432185
C  6.025649 -2.214724 -0.589387
C  1.107742 3.451119 2.303047
C  -6.005566 -2.273215 0.569169
C  -1.136306 3.464842 -2.265323
C  4.516471 -2.062244 -2.483867
C  2.905295 3.372453 0.674997
C  -4.494775 -2.133998 2.463377
C  -2.936559 3.35488 -0.642046
C  5.840534 -2.099382 -1.984521
C  1.947009 4.128574 1.39121
C  -5.819247 -2.174683 1.965432
C  -1.983059 4.12607 -1.348518
H  -0.171421 -1.687829 1.301856
H  -0.062616 0.078911 1.201463
H  0.060743 0.092038 -1.200908
H  0.184967 -1.672425 -1.31999
H  2.54399 -2.759286 1.483369
H  1.583264 -2.8516 -0.025456
H  2.094377 -0.474543 2.819716
H  3.512029 -0.328775 1.723621
H  -2.522291 -2.764318 -1.514975
H  -1.558751 -2.866937 -0.008604
H  -2.091432 -0.462667 -2.825051
H  -3.510283 -0.340686 -1.727549
H  4.991808 -2.383176 1.330387
H  0.627372 1.497357 3.158367
H  -4.973391 -2.408702 -1.354076
H  -0.638169 1.523979 -3.139462
H  7.032804 -2.254959 -0.160505
H  0.353977 3.995446 2.881976
H  -7.013024 -2.315582 0.141209
H  -0.38581 4.021192 -2.837014
H  4.328137 -1.990024 -3.561939
H  3.587383 3.859582 -0.032532
H  -4.305388 -2.07452 3.542042
H  -3.624032 3.829197 0.068967
H  6.691907 -2.046354 -2.670708
H  1.871001 5.210429 1.240818
H  -6.669972 -2.137129 2.653443
H  -1.916297 5.206926 -1.18696
