program: Gaussian 16
title: K-n-Me
version: ES64L-G16RevC.01
frameworkgroup: C1[X(C13H18O)]
method: RPBE1PBE
basis: def2TZVPP
operation: Freq
keyword: #N
keyword: Geom=AllCheck
keyword: Guess=TCheck
keyword: SCRF=Check
keyword: GenChk
keyword: RPBE1PBE/def2TZVPP
keyword: Freq
converged: YES YES YES YES
title: Mulliken charges:
elementType: C C C C C C C C C O H H H H H H C H H H C H H H C H H H C H H H
charge: -0.283252 -0.064312 -0.162754 0.505040 -0.156871 -0.116079 0.100003 0.449560 -0.359978 -0.349603 0.100050 0.110788 0.089529 0.087902 0.081043 0.090729 -0.337180 0.095885 0.089708 0.095979 -0.350161 0.091261 0.097174 0.090360 -0.279519 0.096103 0.091563 0.094964 -0.286002 0.097100 0.096740 0.094231
chargesum: 0.00000
title: Mulliken charges with hydrogens summed into heavy atoms:
elementType: C C C C C C C C C O C C C C
charge: -0.183201 -0.064312 0.017504 0.505040 -0.046083 -0.116079 0.100003 0.449560 -0.191033 -0.349603 -0.055608 -0.071366 0.003110 0.002069
1716.lowfreq: -6.8329 -3.1338 -0.0007 0.0004 0.0008 8.9104 49.0588 88.7924 163.3015
frequency: 49.0401 88.7891 163.2989 177.5856 200.2874 211.3400 242.3130 252.1381 253.5466 263.1813 272.2672 280.6168 333.0709 344.8298 366.7052 379.0888 393.5522 442.3169 470.4794 480.1178 516.2431 549.8499 592.9987 623.3246 743.3239 796.7072 847.2679 860.4335 885.5486 890.7779 924.0049 929.4687 937.0984 966.9968 983.1559 990.6232 1017.4372 1037.3011 1050.9348 1056.4312 1067.7722 1108.8210 1115.8114 1152.3647 1183.4200 1211.0737 1235.1244 1249.0924 1271.2365 1284.7741 1294.7076 1330.8675 1376.2087 1379.4726 1390.2475 1394.7984 1396.5137 1403.2016 1408.9271 1441.5106 1451.8743 1455.9199 1464.8496 1466.6003 1471.7485 1472.2465 1473.9672 1477.2594 1480.4685 1707.1431 1739.5754 1744.7471 3020.1644 3030.0686 3039.1103 3042.6305 3048.2062 3048.7956 3064.0394 3084.5492 3090.5098 3109.1324 3116.6478 3120.5664 3121.5348 3129.4528 3138.6775 3138.9050 3149.2446 3156.0667
redmass: 4.9961 3.0714 1.3724 1.1039 1.8564 1.6512 1.6363 1.1451 1.6779 2.0043 2.2897 2.2365 3.8049 3.0321 3.9281 3.6266 2.5807 2.4616 3.6539 2.9263 3.1282 3.7113 3.2096 2.7359 3.7645 3.5510 1.6262 2.8093 2.0312 3.4209 1.5674 1.7134 1.9128 1.9782 2.0003 1.4656 1.5755 1.5564 1.7030 1.5765 1.5707 2.3927 1.4773 2.0033 1.4506 2.2127 2.4739 5.0381 1.9317 2.3988 1.5921 1.6736 1.8189 1.9599 1.5536 1.3323 1.2967 1.5388 1.7590 1.0939 1.0437 1.0435 1.0647 1.0713 1.0596 1.0926 1.0624 1.0562 1.0685 7.8859 7.6378 12.5476 1.0638 1.0390 1.0401 1.0520 1.0374 1.0377 1.0956 1.0995 1.1049 1.1000 1.1024 1.1024 1.1025 1.1009 1.1026 1.1015 1.0906 1.0905
irintensity: 7.3831 0.2186 1.1441 0.5185 0.2461 0.3773 0.2099 0.0399 0.3969 1.4818 1.4244 0.3871 6.0519 3.1258 2.9374 21.1089 6.5773 2.5567 0.7596 2.3212 8.8557 0.4151 6.5090 0.3129 2.7904 4.4950 27.2152 6.6670 2.6308 0.0531 19.9559 11.4494 3.1831 20.3733 15.0249 12.9450 14.2602 12.2289 21.3608 21.0056 5.4331 1.2656 2.9381 4.3366 3.0386 27.7026 3.8186 5.1462 6.2603 1.9372 9.9770 0.7717 11.6002 40.5260 1.9982 19.4710 7.4647 10.0196 13.1077 18.2883 13.4841 14.3184 11.2425 5.8622 25.7204 18.3618 9.3671 9.9839 19.6000 41.8504 17.6160 411.0396 27.8226 62.8354 23.6668 56.1062 69.0398 22.2950 18.6808 23.0269 38.6914 15.5711 36.4772 33.7180 43.5219 27.6904 8.6100 29.7587 26.8314 39.5507
temp: 298.150 k
press: 1.00000 atm
elementType: 6 6 6 6 6 6 6 6 6 8 1 1 1 1 1 1 6 1 1 1 6 1 1 1 6 1 1 1 6 1 1 1
symmnumber: 1
zpe: 733401.4 jmol-1
zpe.correction: 0.279338 hartree
zpe.thermalcorrener: 0.293250 hartree
zpe.thermalcorrenthalpy: 0.294194 hartree
zpe.thermalcorrgfe: 0.240427 hartree
zpe.sumelectzpe: -580.728593 hartree
zpe.sumelectthermal: -580.714681 hartree
zpe.sumelectthermalent: -580.713737 hartree
zpe.sumelectthermalfe: -580.767504 hartree
dipole: 3.0589 2.2476 0.8090
dipole: 3.8811
quadrupole: -91.0338 -83.3097 -83.9665
quadrupole: -7.1470 -2.2651 -1.7987
quadrupole: -4.9304 2.7936 2.1368 -7.1470 -2.2651 -1.7987
hfenergy: -581.007931 hartree
pointgroup: C01 [X(C13H18O1)]
dipole: 1.4431247 0.4162386 0.2752226 debye
polarizability: 215.4642393|11.9788674|215.4758419|3.4802345|3.2547363|174.3869616 unknown
InChI: InChI=1S/C13H18O/c1-9-5-12(3)7-10(2)11(14)13(4,6-9)8-12/h5,7H,6,8H2,1-4H3
charge 0 multiplicity 1
32 atoms
C  1.90873232 0.15807547 -0.53930426
C  1.51916775 -1.07595632 -0.85315028
C  0.33431975 -1.7202312 -0.19651744
C  1.17762282 1.01835228 0.46747945
C  0.14516516 1.80207006 -0.29669147
C  -1.08971711 1.35161874 -0.55233928
C  -1.47616115 -0.00522942 -0.11330605
C  -0.49244537 -0.81438171 0.73484784
C  0.45697667 0.12305114 1.46565111
O  -2.54673744 -0.47785314 -0.44814227
H  2.76407785 0.60345914 -1.04102714
H  0.45118415 2.76922782 -0.69059663
H  -0.31233899 -2.16356034 -0.96156
H  -0.0978156 0.74108234 2.17815633
H  1.18726268 -0.46336378 2.03135306
H  0.69794191 -2.5674701 0.3991573
C  2.14417773 1.95803264 1.17311055
H  2.89839721 1.38888916 1.72150395
H  2.65969203 2.60043262 0.4546314
H  1.61562911 2.59823867 1.88374597
C  -1.27407049 -1.67359935 1.71629057
H  -1.90997383 -1.05872704 2.35756284
H  -1.91205109 -2.38789285 1.19510255
H  -0.58043386 -2.22749651 2.3532119
C  2.23178022 -1.91154617 -1.86384266
H  1.56545286 -2.16782689 -2.69422204
H  3.10457443 -1.39763838 -2.26914593
H  2.56164857 -2.85931654 -1.42567959
C  -2.09671054 2.12395972 -1.33729067
H  -2.38399271 1.58378657 -2.24293649
H  -3.01357151 2.27442234 -0.76196848
H  -1.7008777 3.09931346 -1.62226233
