program: Gaussian 16
title: T-n
version: ES64L-G16RevC.01
frameworkgroup: C1[X(C10H10O)]
method: RPBE1PBE
basis: def2TZVPP
operation: Freq
keyword: #N
keyword: Geom=AllCheck
keyword: Guess=TCheck
keyword: SCRF=Check
keyword: GenChk
keyword: RPBE1PBE/def2TZVPPFreq
converged: YES YES YES YES
title: Mulliken charges:
elementType: C C C C C C C C C H H H H H H H C H H H O
charge: -0.241651 -0.215944 -0.058892 0.249171 -0.118668 -0.228664 0.143309 0.185295 -0.169491 0.129101 0.140625 0.081061 0.061542 0.120868 0.120098 0.087539 -0.262602 0.109093 0.108411 0.096105 -0.336308
chargesum: 0.00000
title: Mulliken charges with hydrogens summed into heavy atoms:
elementType: C C C C C C C C C C O
charge: -0.112549 -0.095846 0.124752 0.330232 0.021958 -0.107796 0.143309 0.246837 -0.169491 -0.045098 -0.336308
1716.lowfreq: -10.1303 -8.3146 -0.0009 -0.0003 0.0007 8.5981 66.1054 135.7851 202.6897
frequency: 66.0865 135.7703 202.6882 219.2034 324.8802 338.7387 410.7000 442.1307 480.5552 511.1929 585.3040 612.6606 664.7189 706.2753 726.8914 745.3782 807.2077 834.0865 850.7519 908.5253 929.6436 932.1586 982.5096 989.5246 1003.4880 1011.3290 1021.7415 1034.4966 1071.9025 1138.4784 1157.7521 1196.1116 1251.9943 1261.2908 1279.1907 1297.9173 1306.2856 1323.9875 1370.9353 1393.3441 1405.0488 1439.6115 1447.1507 1679.3108 1723.1761 1738.4792 1764.1051 3041.8601 3079.2509 3100.6056 3108.2631 3145.1436 3169.2825 3182.5858 3194.5818 3206.2187 3234.0690
redmass: 4.8666 3.5172 2.6734 3.7375 2.7124 3.2207 3.4346 2.7075 4.9769 4.1823 4.3177 5.7230 1.7018 4.1008 2.0622 1.2044 2.1910 2.3609 3.0364 2.5330 1.6410 1.8258 1.6791 3.3391 1.6560 2.0657 1.5431 1.5536 1.7930 1.3207 1.1109 1.1312 1.5783 1.5622 1.4489 1.7139 1.5741 2.1937 1.9358 1.7123 1.7157 1.1718 1.1191 6.8466 6.8115 6.9332 10.5834 1.0629 1.0991 1.0855 1.0861 1.0606 1.0859 1.0877 1.0979 1.0982 1.1167
irintensity: 8.1963 1.0280 1.6438 0.5705 1.7327 7.1491 2.6977 0.2155 12.5877 7.7429 11.2327 13.3468 31.1370 11.4813 63.7681 2.7451 21.1239 34.5762 19.0002 25.9930 50.6813 19.7292 6.4956 1.4590 0.0744 7.7034 2.5441 5.8422 8.7540 32.7118 1.3547 17.9075 29.0346 17.1856 9.7380 14.7110 4.2563 3.4236 7.7377 13.9435 38.6058 7.8030 23.0305 57.2440 8.3723 200.3129 383.4917 24.8450 12.1964 17.0107 15.9315 5.8974 6.4558 6.2209 27.4685 9.3476 10.1361
temp: 298.150 k
press: 1.00000 atm
elementType: 6 6 6 6 6 6 6 6 6 1 1 1 1 1 1 1 6 1 1 1 8
symmnumber: 1
zpe: 455696.9 jmol-1
zpe.correction: 0.173566 hartree
zpe.thermalcorrener: 0.182277 hartree
zpe.thermalcorrenthalpy: 0.183221 hartree
zpe.thermalcorrgfe: 0.139916 hartree
zpe.sumelectzpe: -461.741172 hartree
zpe.sumelectthermal: -461.732461 hartree
zpe.sumelectthermalent: -461.731517 hartree
zpe.sumelectthermalfe: -461.774822 hartree
dipole: -4.0759 -0.6317 -1.2812
dipole: 4.3190
quadrupole: -75.3694 -59.3399 -60.2136
quadrupole: 0.4768 0.6122 3.0507
quadrupole: -10.3951 5.6344 4.7607 0.4768 0.6122 3.0507
hfenergy: -461.9147376 hartree
pointgroup: C01 [X(C10H10O1)]
dipole: -0.8357046 0.2056171 1.4651523 debye
dipolederiv: 0.0926834 0.2977737 0.0334156 0.378926 -0.1740196 -0.1687737 -0.0489616 0.0572423 -0.0722783 -0.1786364 0.1332681 0.016847 0.0902698 -0.1553644 -0.0566432 0.0469808 -0.0335236 0.2420891 0.1574218 0.0284195 -0.0070852 0.0995506 0.1266352 0.0723797 -0.0356683 -0.0502496 -0.0674644 -0.1545778 0.0131597 0.0821617 -0.0756007 0.0609281 0.2009074 -0.0153194 0.0866482 0.0685933 0.3798918 -0.2803886 -0.3114891 -0.3154228 -0.0677616 0.0209952 -0.0847567 0.1037314 0.3735515 -0.1960323 -0.0581605 -0.1581456 -0.0433831 -0.1521783 0.1769135 0.1644187 -0.0143188 -0.9157218 0.8845507 -0.5824768 -0.0783241 -0.4911058 0.5883591 0.0156 -0.3845161 0.1255767 1.8907522 -0.2520422 0.1688791 0.0149642 0.1129364 -0.1943504 -0.1379966 -0.0424247 -0.064551 0.0071822 -0.2757641 0.010063 -0.0128286 -0.0236853 0.7138164 0.0358533 -0.0276962 0.0031793 0.0615752 0.062962 -0.1173022 0.0595978 -0.1157223 0.0768741 0.0868181 0.0468317 0.055279 -0.0529019 0.0746777 0.0912716 -0.0663415 0.0883146 0.0748656 0.0596773 -0.0551809 0.0462579 -0.0127111 0.0566907 -0.0001582 -0.0027249 0.0007151 -0.0035149 -0.1367502 -0.003703 -0.0491899 -0.0520422 0.0548735 -0.0129551 0.0419978 0.0000388 -0.0062456 0.0942735 0.023492 0.0631567 -0.0657837 0.0259012 0.1375832 -0.0066439 0.1482374 0.1012965 0.006896 0.0271621 -0.0054665 0.0740262 -0.0095371 -0.160699 -0.0003914 -0.1699031 0.0705045 0.0163499 0.0108649 0.0268495 0.0749176 0.1025643 -0.0209112 0.088939 -0.0208712 -0.0517727 -0.1028672 -0.0114129 -0.0862105 -0.0337783 -0.4018388 -0.0030658 -0.0081179 0.0127992 -0.4517318 -0.0647704 -0.0035747 -0.008393 0.1011858 0.2039953 0.0070763 0.0000951 0.0017226 0.0112135 0.0251727 0.0019289 0.1102483 -0.0585227 0.1924371 -0.0007184 0.0035222 0.0022257 0.0302574 -0.0256095 0.0027629 -0.1025336 -0.0712572 -0.0565333 0.0447634 -0.026487 0.0718543 0.0398652 0.1189679 -0.0604856 0.0317205 0.0161086 -0.7636877 0.3045783 0.3370388 0.2481038 -0.6376763 -0.2373937 0.4492579 -0.2954534 -1.50752 unknown
polarizability: 135.5569531|-3.5865762|148.4189151|-1.9684442|8.1079809|166.76693 unknown
InChI: InChI=1S/C10H10O/c1-7-8-3-2-4-9(7)10(11)6-5-8/h2-3,5-6,8-9H,1,4H2
charge 0 multiplicity 1
21 atoms
C  -1.20092689 -0.65843611 1.20895062
C  -1.75125581 -0.98691774 0.04550407
C  -1.27339024 -0.47368698 -1.27403769
C  0.00799011 0.2527042 1.27393893
C  1.23803387 -0.61482809 1.21618782
C  1.80058428 -0.97009279 0.05779432
C  1.2398844 -0.53925266 -1.22688593
C  0.01615315 0.37052104 -1.18738005
C  0.0001776 1.16122547 0.08123075
H  -1.5792103 -1.06129639 2.14209762
H  1.63865421 -0.98208811 2.15579076
H  -0.00030125 0.82369578 2.20337839
H  0.07946267 1.01641073 -2.06366327
H  2.67203137 -1.61348342 0.01943678
H  -2.60687071 -1.65512769 0.02609652
H  -1.13640595 -1.30354774 -1.97419295
C  -0.02051086 2.48516348 0.14753033
H  -0.02351428 3.0909698 -0.75248897
H  -0.03746832 3.00294281 1.10058229
H  -2.05864395 0.15409609 -1.70946805
O  1.70973409 -0.90127728 -2.28738577
